hc-commits mailing list archives

Site index · List index
Message view « Date » · « Thread »
Top « Date » · « Thread »
From Apache Jenkins Server <jenk...@builds.apache.org>
Subject Build failed in Jenkins: httpcomponents-client-4.5.x #123
Date Tue, 01 Aug 2017 01:05:58 GMT
See <https://builds.apache.org/job/httpcomponents-client-4.5.x/123/display/redirect?page=changes>

Changes:

[ggregory] Clean up: Order GID before AID.

------------------------------------------
[...truncated 115.81 KB...]
[ERROR] <https://builds.apache.org/job/httpcomponents-client-4.5.x/ws/httpclient/src/main/java/org/apache/http/conn/HttpHostConnectException.java>:62:
warning: no @param for host
[ERROR] public HttpHostConnectException(
[ERROR] ^
[ERROR] <https://builds.apache.org/job/httpcomponents-client-4.5.x/ws/httpclient/src/main/java/org/apache/http/conn/HttpHostConnectException.java>:62:
warning: no @param for remoteAddresses
[ERROR] public HttpHostConnectException(
[ERROR] ^
[ERROR] <https://builds.apache.org/job/httpcomponents-client-4.5.x/ws/httpclient/src/main/java/org/apache/http/conn/ManagedClientConnection.java>:233:
warning: no @param for duration
[ERROR] void setIdleDuration(long duration, TimeUnit unit);
[ERROR] ^
[ERROR] <https://builds.apache.org/job/httpcomponents-client-4.5.x/ws/httpclient/src/main/java/org/apache/http/conn/ManagedClientConnection.java>:233:
warning: no @param for unit
[ERROR] void setIdleDuration(long duration, TimeUnit unit);
[ERROR] ^
[ERROR] <https://builds.apache.org/job/httpcomponents-client-4.5.x/ws/httpclient/src/main/java/org/apache/http/conn/ManagedHttpClientConnection.java>:52:
warning: no @return
[ERROR] String getId();
[ERROR] ^
[ERROR] <https://builds.apache.org/job/httpcomponents-client-4.5.x/ws/httpclient/src/main/java/org/apache/http/conn/ManagedHttpClientConnection.java>:60:
warning: no description for @throws
[ERROR] * @throws IOException
[ERROR] ^
[ERROR] <https://builds.apache.org/job/httpcomponents-client-4.5.x/ws/httpclient/src/main/java/org/apache/http/conn/ManagedHttpClientConnection.java>:67:
warning: no @return
[ERROR] Socket getSocket();
[ERROR] ^
[ERROR] <https://builds.apache.org/job/httpcomponents-client-4.5.x/ws/httpclient/src/main/java-deprecated/org/apache/http/conn/OperatedClientConnection.java>:113:
warning: no @throws for java.io.IOException
[ERROR] void opening(Socket sock, HttpHost target)
[ERROR] ^
[ERROR] <https://builds.apache.org/job/httpcomponents-client-4.5.x/ws/httpclient/src/main/java-deprecated/org/apache/http/conn/OperatedClientConnection.java>:128:
warning: no @throws for java.io.IOException
[ERROR] void openCompleted(boolean secure, HttpParams params)
[ERROR] ^
[ERROR] <https://builds.apache.org/job/httpcomponents-client-4.5.x/ws/httpclient/src/main/java-deprecated/org/apache/http/conn/OperatedClientConnection.java>:153:
warning: no @throws for java.io.IOException
[ERROR] void update(Socket sock, HttpHost target,
[ERROR] ^
[ERROR] <https://builds.apache.org/job/httpcomponents-client-4.5.x/ws/httpclient/src/main/java/org/apache/http/conn/SchemePortResolver.java>:41:
warning: no @param for host
[ERROR] int resolve(HttpHost host) throws UnsupportedSchemeException;
[ERROR] ^
[ERROR] <https://builds.apache.org/job/httpcomponents-client-4.5.x/ws/httpclient/src/main/java/org/apache/http/conn/SchemePortResolver.java>:41:
warning: no @return
[ERROR] int resolve(HttpHost host) throws UnsupportedSchemeException;
[ERROR] ^
[ERROR] <https://builds.apache.org/job/httpcomponents-client-4.5.x/ws/httpclient/src/main/java/org/apache/http/conn/SchemePortResolver.java>:41:
warning: no @throws for org.apache.http.conn.UnsupportedSchemeException
[ERROR] int resolve(HttpHost host) throws UnsupportedSchemeException;
[ERROR] ^
[ERROR] <https://builds.apache.org/job/httpcomponents-client-4.5.x/ws/httpclient/src/main/java/org/apache/http/conn/UnsupportedSchemeException.java>:44:
warning: no @param for message
[ERROR] public UnsupportedSchemeException(final String message) {
[ERROR] ^
[ERROR] <https://builds.apache.org/job/httpcomponents-client-4.5.x/ws/httpclient/src/main/java-deprecated/org/apache/http/conn/params/ConnConnectionParamBean.java>:55:
warning: no @param for maxStatusLineGarbage
[ERROR] public void setMaxStatusLineGarbage (final int maxStatusLineGarbage) {
[ERROR] ^
[ERROR] <https://builds.apache.org/job/httpcomponents-client-4.5.x/ws/httpclient/src/main/java-deprecated/org/apache/http/conn/params/ConnManagerParams.java>:63:
warning: no @param for params
[ERROR] public static long getTimeout(final HttpParams params) {
[ERROR] ^
[ERROR] <https://builds.apache.org/job/httpcomponents-client-4.5.x/ws/httpclient/src/main/java-deprecated/org/apache/http/conn/params/ConnManagerParams.java>:79:
warning: no @param for params
[ERROR] public static void setTimeout(final HttpParams params, final long timeout) {
[ERROR] ^
[ERROR] <https://builds.apache.org/job/httpcomponents-client-4.5.x/ws/httpclient/src/main/java/org/apache/http/conn/params/ConnManagerPNames.java>:54:
warning: empty <p> tag
[ERROR] * <p>
[ERROR] ^
[ERROR] <https://builds.apache.org/job/httpcomponents-client-4.5.x/ws/httpclient/src/main/java-deprecated/org/apache/http/conn/params/ConnPerRouteBean.java>:75:
warning: no @return
[ERROR] public int getDefaultMaxPerRoute() {
[ERROR] ^
[ERROR] <https://builds.apache.org/job/httpcomponents-client-4.5.x/ws/httpclient/src/main/java-deprecated/org/apache/http/conn/params/ConnRouteParamBean.java>:54:
warning: no @param for defaultProxy
[ERROR] public void setDefaultProxy (final HttpHost defaultProxy) {
[ERROR] ^
[ERROR] <https://builds.apache.org/job/httpcomponents-client-4.5.x/ws/httpclient/src/main/java-deprecated/org/apache/http/conn/params/ConnRouteParamBean.java>:59:
warning: no @param for address
[ERROR] public void setLocalAddress (final InetAddress address) {
[ERROR] ^
[ERROR] <https://builds.apache.org/job/httpcomponents-client-4.5.x/ws/httpclient/src/main/java-deprecated/org/apache/http/conn/params/ConnRouteParamBean.java>:64:
warning: no @param for route
[ERROR] public void setForcedRoute (final HttpRoute route) {
[ERROR] ^
[ERROR] <https://builds.apache.org/job/httpcomponents-client-4.5.x/ws/httpclient/src/main/java/org/apache/http/conn/socket/ConnectionSocketFactory.java>:53:
warning: no @param for context
[ERROR] Socket createSocket(HttpContext context) throws IOException;
[ERROR] ^
[ERROR] <https://builds.apache.org/job/httpcomponents-client-4.5.x/ws/httpclient/src/main/java/org/apache/http/conn/socket/LayeredConnectionSocketFactory.java>:57:
warning: no @throws for java.net.UnknownHostException
[ERROR] Socket createLayeredSocket(
[ERROR] ^
[ERROR] <https://builds.apache.org/job/httpcomponents-client-4.5.x/ws/httpclient/src/main/java-deprecated/org/apache/http/conn/ssl/PrivateKeyStrategy.java>:45:
warning: no @param for aliases
[ERROR] String chooseAlias(Map<String, PrivateKeyDetails> aliases, Socket socket);
[ERROR] ^
[ERROR] <https://builds.apache.org/job/httpcomponents-client-4.5.x/ws/httpclient/src/main/java-deprecated/org/apache/http/conn/ssl/PrivateKeyStrategy.java>:45:
warning: no @param for socket
[ERROR] String chooseAlias(Map<String, PrivateKeyDetails> aliases, Socket socket);
[ERROR] ^
[ERROR] <https://builds.apache.org/job/httpcomponents-client-4.5.x/ws/httpclient/src/main/java-deprecated/org/apache/http/conn/ssl/PrivateKeyStrategy.java>:45:
warning: no @return
[ERROR] String chooseAlias(Map<String, PrivateKeyDetails> aliases, Socket socket);
[ERROR] ^
[ERROR] <https://builds.apache.org/job/httpcomponents-client-4.5.x/ws/httpclient/src/main/java/org/apache/http/conn/ssl/SSLConnectionSocketFactory.java>:162:
warning: no @return
[ERROR] public static HostnameVerifier getDefaultHostnameVerifier() {
[ERROR] ^
[ERROR] <https://builds.apache.org/job/httpcomponents-client-4.5.x/ws/httpclient/src/main/java/org/apache/http/conn/ssl/SSLConnectionSocketFactory.java>:310:
warning: no @param for socket
[ERROR] protected void prepareSocket(final SSLSocket socket) throws IOException {
[ERROR] ^
[ERROR] <https://builds.apache.org/job/httpcomponents-client-4.5.x/ws/httpclient/src/main/java/org/apache/http/conn/ssl/SSLConnectionSocketFactory.java>:261:
warning: no @param for sslContext
[ERROR] public SSLConnectionSocketFactory(
[ERROR] ^
[ERROR] <https://builds.apache.org/job/httpcomponents-client-4.5.x/ws/httpclient/src/main/java/org/apache/http/conn/ssl/SSLConnectionSocketFactory.java>:261:
warning: no @param for hostnameVerifier
[ERROR] public SSLConnectionSocketFactory(
[ERROR] ^
[ERROR] <https://builds.apache.org/job/httpcomponents-client-4.5.x/ws/httpclient/src/main/java/org/apache/http/conn/ssl/SSLConnectionSocketFactory.java>:270:
warning: no @param for sslContext
[ERROR] public SSLConnectionSocketFactory(
[ERROR] ^
[ERROR] <https://builds.apache.org/job/httpcomponents-client-4.5.x/ws/httpclient/src/main/java/org/apache/http/conn/ssl/SSLConnectionSocketFactory.java>:270:
warning: no @param for supportedProtocols
[ERROR] public SSLConnectionSocketFactory(
[ERROR] ^
[ERROR] <https://builds.apache.org/job/httpcomponents-client-4.5.x/ws/httpclient/src/main/java/org/apache/http/conn/ssl/SSLConnectionSocketFactory.java>:270:
warning: no @param for supportedCipherSuites
[ERROR] public SSLConnectionSocketFactory(
[ERROR] ^
[ERROR] <https://builds.apache.org/job/httpcomponents-client-4.5.x/ws/httpclient/src/main/java/org/apache/http/conn/ssl/SSLConnectionSocketFactory.java>:270:
warning: no @param for hostnameVerifier
[ERROR] public SSLConnectionSocketFactory(
[ERROR] ^
[ERROR] <https://builds.apache.org/job/httpcomponents-client-4.5.x/ws/httpclient/src/main/java/org/apache/http/conn/ssl/SSLConnectionSocketFactory.java>:225:
warning: no @param for sslContext
[ERROR] public SSLConnectionSocketFactory(
[ERROR] ^
[ERROR] <https://builds.apache.org/job/httpcomponents-client-4.5.x/ws/httpclient/src/main/java/org/apache/http/conn/ssl/SSLConnectionSocketFactory.java>:225:
warning: no @param for supportedProtocols
[ERROR] public SSLConnectionSocketFactory(
[ERROR] ^
[ERROR] <https://builds.apache.org/job/httpcomponents-client-4.5.x/ws/httpclient/src/main/java/org/apache/http/conn/ssl/SSLConnectionSocketFactory.java>:225:
warning: no @param for supportedCipherSuites
[ERROR] public SSLConnectionSocketFactory(
[ERROR] ^
[ERROR] <https://builds.apache.org/job/httpcomponents-client-4.5.x/ws/httpclient/src/main/java/org/apache/http/conn/ssl/SSLConnectionSocketFactory.java>:225:
warning: no @param for hostnameVerifier
[ERROR] public SSLConnectionSocketFactory(
[ERROR] ^
[ERROR] <https://builds.apache.org/job/httpcomponents-client-4.5.x/ws/httpclient/src/main/java/org/apache/http/conn/ssl/SSLConnectionSocketFactory.java>:214:
warning: no @param for sslContext
[ERROR] public SSLConnectionSocketFactory(
[ERROR] ^
[ERROR] <https://builds.apache.org/job/httpcomponents-client-4.5.x/ws/httpclient/src/main/java/org/apache/http/conn/ssl/SSLConnectionSocketFactory.java>:214:
warning: no @param for hostnameVerifier
[ERROR] public SSLConnectionSocketFactory(
[ERROR] ^
[ERROR] <https://builds.apache.org/job/httpcomponents-client-4.5.x/ws/httpclient/src/main/java/org/apache/http/conn/ssl/SSLConnectionSocketFactory.java>:282:
warning: no @param for socketfactory
[ERROR] public SSLConnectionSocketFactory(
[ERROR] ^
[ERROR] <https://builds.apache.org/job/httpcomponents-client-4.5.x/ws/httpclient/src/main/java/org/apache/http/conn/ssl/SSLConnectionSocketFactory.java>:282:
warning: no @param for hostnameVerifier
[ERROR] public SSLConnectionSocketFactory(
[ERROR] ^
[ERROR] <https://builds.apache.org/job/httpcomponents-client-4.5.x/ws/httpclient/src/main/java/org/apache/http/conn/ssl/SSLConnectionSocketFactory.java>:291:
warning: no @param for socketfactory
[ERROR] public SSLConnectionSocketFactory(
[ERROR] ^
[ERROR] <https://builds.apache.org/job/httpcomponents-client-4.5.x/ws/httpclient/src/main/java/org/apache/http/conn/ssl/SSLConnectionSocketFactory.java>:291:
warning: no @param for supportedProtocols
[ERROR] public SSLConnectionSocketFactory(
[ERROR] ^
[ERROR] <https://builds.apache.org/job/httpcomponents-client-4.5.x/ws/httpclient/src/main/java/org/apache/http/conn/ssl/SSLConnectionSocketFactory.java>:291:
warning: no @param for supportedCipherSuites
[ERROR] public SSLConnectionSocketFactory(
[ERROR] ^
[ERROR] <https://builds.apache.org/job/httpcomponents-client-4.5.x/ws/httpclient/src/main/java/org/apache/http/conn/ssl/SSLConnectionSocketFactory.java>:291:
warning: no @param for hostnameVerifier
[ERROR] public SSLConnectionSocketFactory(
[ERROR] ^
[ERROR] <https://builds.apache.org/job/httpcomponents-client-4.5.x/ws/httpclient/src/main/java/org/apache/http/conn/ssl/SSLConnectionSocketFactory.java>:250:
warning: no @param for socketfactory
[ERROR] public SSLConnectionSocketFactory(
[ERROR] ^
[ERROR] <https://builds.apache.org/job/httpcomponents-client-4.5.x/ws/httpclient/src/main/java/org/apache/http/conn/ssl/SSLConnectionSocketFactory.java>:250:
warning: no @param for supportedProtocols
[ERROR] public SSLConnectionSocketFactory(
[ERROR] ^
[ERROR] <https://builds.apache.org/job/httpcomponents-client-4.5.x/ws/httpclient/src/main/java/org/apache/http/conn/ssl/SSLConnectionSocketFactory.java>:250:
warning: no @param for supportedCipherSuites
[ERROR] public SSLConnectionSocketFactory(
[ERROR] ^
[ERROR] <https://builds.apache.org/job/httpcomponents-client-4.5.x/ws/httpclient/src/main/java/org/apache/http/conn/ssl/SSLConnectionSocketFactory.java>:250:
warning: no @param for hostnameVerifier
[ERROR] public SSLConnectionSocketFactory(
[ERROR] ^
[ERROR] <https://builds.apache.org/job/httpcomponents-client-4.5.x/ws/httpclient/src/main/java/org/apache/http/conn/ssl/SSLConnectionSocketFactory.java>:239:
warning: no @param for socketfactory
[ERROR] public SSLConnectionSocketFactory(
[ERROR] ^
[ERROR] <https://builds.apache.org/job/httpcomponents-client-4.5.x/ws/httpclient/src/main/java/org/apache/http/conn/ssl/SSLConnectionSocketFactory.java>:239:
warning: no @param for hostnameVerifier
[ERROR] public SSLConnectionSocketFactory(
[ERROR] ^
[ERROR] <https://builds.apache.org/job/httpcomponents-client-4.5.x/ws/httpclient/src/main/java-deprecated/org/apache/http/conn/ssl/SSLSocketFactory.java>:509:
warning: no @param for socket
[ERROR] protected void prepareSocket(final SSLSocket socket) throws IOException {
[ERROR] ^
[ERROR] <https://builds.apache.org/job/httpcomponents-client-4.5.x/ws/httpclient/src/main/java-deprecated/org/apache/http/conn/ssl/SSLSocketFactory.java>:346:
warning: no @param for sslContext
[ERROR] public SSLSocketFactory(
[ERROR] ^
[ERROR] <https://builds.apache.org/job/httpcomponents-client-4.5.x/ws/httpclient/src/main/java-deprecated/org/apache/http/conn/ssl/SSLSocketFactory.java>:346:
warning: no @param for supportedProtocols
[ERROR] public SSLSocketFactory(
[ERROR] ^
[ERROR] <https://builds.apache.org/job/httpcomponents-client-4.5.x/ws/httpclient/src/main/java-deprecated/org/apache/http/conn/ssl/SSLSocketFactory.java>:346:
warning: no @param for supportedCipherSuites
[ERROR] public SSLSocketFactory(
[ERROR] ^
[ERROR] <https://builds.apache.org/job/httpcomponents-client-4.5.x/ws/httpclient/src/main/java-deprecated/org/apache/http/conn/ssl/SSLSocketFactory.java>:346:
warning: no @param for hostnameVerifier
[ERROR] public SSLSocketFactory(
[ERROR] ^
[ERROR] <https://builds.apache.org/job/httpcomponents-client-4.5.x/ws/httpclient/src/main/java-deprecated/org/apache/http/conn/ssl/SSLSocketFactory.java>:337:
warning: no @param for sslContext
[ERROR] public SSLSocketFactory(
[ERROR] ^
[ERROR] <https://builds.apache.org/job/httpcomponents-client-4.5.x/ws/httpclient/src/main/java-deprecated/org/apache/http/conn/ssl/SSLSocketFactory.java>:337:
warning: no @param for hostnameVerifier
[ERROR] public SSLSocketFactory(
[ERROR] ^
[ERROR] <https://builds.apache.org/job/httpcomponents-client-4.5.x/ws/httpclient/src/main/java-deprecated/org/apache/http/conn/ssl/SSLSocketFactory.java>:367:
warning: no @param for socketfactory
[ERROR] public SSLSocketFactory(
[ERROR] ^
[ERROR] <https://builds.apache.org/job/httpcomponents-client-4.5.x/ws/httpclient/src/main/java-deprecated/org/apache/http/conn/ssl/SSLSocketFactory.java>:367:
warning: no @param for supportedProtocols
[ERROR] public SSLSocketFactory(
[ERROR] ^
[ERROR] <https://builds.apache.org/job/httpcomponents-client-4.5.x/ws/httpclient/src/main/java-deprecated/org/apache/http/conn/ssl/SSLSocketFactory.java>:367:
warning: no @param for supportedCipherSuites
[ERROR] public SSLSocketFactory(
[ERROR] ^
[ERROR] <https://builds.apache.org/job/httpcomponents-client-4.5.x/ws/httpclient/src/main/java-deprecated/org/apache/http/conn/ssl/SSLSocketFactory.java>:367:
warning: no @param for hostnameVerifier
[ERROR] public SSLSocketFactory(
[ERROR] ^
[ERROR] <https://builds.apache.org/job/httpcomponents-client-4.5.x/ws/httpclient/src/main/java-deprecated/org/apache/http/conn/ssl/SSLSocketFactory.java>:358:
warning: no @param for socketfactory
[ERROR] public SSLSocketFactory(
[ERROR] ^
[ERROR] <https://builds.apache.org/job/httpcomponents-client-4.5.x/ws/httpclient/src/main/java-deprecated/org/apache/http/conn/ssl/SSLSocketFactory.java>:358:
warning: no @param for hostnameVerifier
[ERROR] public SSLSocketFactory(
[ERROR] ^
[ERROR] <https://builds.apache.org/job/httpcomponents-client-4.5.x/ws/httpclient/src/main/java-deprecated/org/apache/http/conn/ssl/SSLSocketFactory.java>:226:
warning: no @param for algorithm
[ERROR] public SSLSocketFactory(
[ERROR] ^
[ERROR] <https://builds.apache.org/job/httpcomponents-client-4.5.x/ws/httpclient/src/main/java-deprecated/org/apache/http/conn/ssl/SSLSocketFactory.java>:226:
warning: no @param for keystore
[ERROR] public SSLSocketFactory(
[ERROR] ^
[ERROR] <https://builds.apache.org/job/httpcomponents-client-4.5.x/ws/httpclient/src/main/java-deprecated/org/apache/http/conn/ssl/SSLSocketFactory.java>:226:
warning: no @param for keyPassword
[ERROR] public SSLSocketFactory(
[ERROR] ^
[ERROR] <https://builds.apache.org/job/httpcomponents-client-4.5.x/ws/httpclient/src/main/java-deprecated/org/apache/http/conn/ssl/SSLSocketFactory.java>:226:
warning: no @param for truststore
[ERROR] public SSLSocketFactory(
[ERROR] ^
[ERROR] <https://builds.apache.org/job/httpcomponents-client-4.5.x/ws/httpclient/src/main/java-deprecated/org/apache/http/conn/ssl/SSLSocketFactory.java>:226:
warning: no @param for random
[ERROR] public SSLSocketFactory(
[ERROR] ^
[ERROR] <https://builds.apache.org/job/httpcomponents-client-4.5.x/ws/httpclient/src/main/java-deprecated/org/apache/http/conn/ssl/SSLSocketFactory.java>:226:
warning: no @param for trustStrategy
[ERROR] public SSLSocketFactory(
[ERROR] ^
[ERROR] <https://builds.apache.org/job/httpcomponents-client-4.5.x/ws/httpclient/src/main/java-deprecated/org/apache/http/conn/ssl/SSLSocketFactory.java>:226:
warning: no @param for hostnameVerifier
[ERROR] public SSLSocketFactory(
[ERROR] ^
[ERROR] <https://builds.apache.org/job/httpcomponents-client-4.5.x/ws/httpclient/src/main/java/org/apache/http/client/protocol/ResponseContentEncoding.java>:97:
error: reference not found
[ERROR] * <li>gzip - see {@link GZIPInputStream}</li>
[ERROR] ^
[ERROR] <https://builds.apache.org/job/httpcomponents-client-4.5.x/ws/httpclient/src/main/java/org/apache/http/client/protocol/ResponseContentEncoding.java>:98:
error: reference not found
[ERROR] * <li>deflate - see {@link DeflateInputStream}</li>
[ERROR] ^
[ERROR] 
[ERROR] Command line was: /usr/local/asfpackages/java/jdk1.8.0_131/jre/../bin/javadoc @options
@packages
[ERROR] 
[ERROR] Refer to the generated Javadoc files in '<https://builds.apache.org/job/httpcomponents-client-4.5.x/ws/httpclient/target/apidocs'>
dir.
[ERROR] -> [Help 1]
[ERROR] 
[ERROR] To see the full stack trace of the errors, re-run Maven with the -e switch.
[ERROR] Re-run Maven using the -X switch to enable full debug logging.
[ERROR] 
[ERROR] For more information about the errors and possible solutions, please read the following
articles:
[ERROR] [Help 1] http://cwiki.apache.org/confluence/display/MAVEN/MojoExecutionException
[ERROR] 
[JENKINS] Archiving <https://builds.apache.org/job/httpcomponents-client-4.5.x/ws/httpclient-cache/pom.xml>
to org.apache.httpcomponents/httpclient-cache/4.5.4-SNAPSHOT/httpclient-cache-4.5.4-SNAPSHOT.pom
[ERROR] After correcting the problems, you can resume the build with the command
[ERROR]   mvn <goals> -rf :httpclient
[JENKINS] Archiving <https://builds.apache.org/job/httpcomponents-client-4.5.x/ws/pom.xml>
to org.apache.httpcomponents/httpcomponents-client/4.5.4-SNAPSHOT/httpcomponents-client-4.5.4-SNAPSHOT.pom
[JENKINS] Archiving <https://builds.apache.org/job/httpcomponents-client-4.5.x/ws/fluent-hc/pom.xml>
to org.apache.httpcomponents/fluent-hc/4.5.4-SNAPSHOT/fluent-hc-4.5.4-SNAPSHOT.pom
[JENKINS] Archiving <https://builds.apache.org/job/httpcomponents-client-4.5.x/ws/httpclient-osgi/pom.xml>
to org.apache.httpcomponents/httpclient-osgi/4.5.4-SNAPSHOT/httpclient-osgi-4.5.4-SNAPSHOT.pom
[JENKINS] Archiving <https://builds.apache.org/job/httpcomponents-client-4.5.x/ws/httpclient/pom.xml>
to org.apache.httpcomponents/httpclient/4.5.4-SNAPSHOT/httpclient-4.5.4-SNAPSHOT.pom
[JENKINS] Archiving <https://builds.apache.org/job/httpcomponents-client-4.5.x/ws/httpclient/target/httpclient-4.5.4-SNAPSHOT.jar>
to org.apache.httpcomponents/httpclient/4.5.4-SNAPSHOT/httpclient-4.5.4-SNAPSHOT.jar
[JENKINS] Archiving <https://builds.apache.org/job/httpcomponents-client-4.5.x/ws/httpclient/target/httpclient-4.5.4-SNAPSHOT-sources.jar>
to org.apache.httpcomponents/httpclient/4.5.4-SNAPSHOT/httpclient-4.5.4-SNAPSHOT-sources.jar
[JENKINS] Archiving <https://builds.apache.org/job/httpcomponents-client-4.5.x/ws/httpclient-win/pom.xml>
to org.apache.httpcomponents/httpclient-win/4.5.4-SNAPSHOT/httpclient-win-4.5.4-SNAPSHOT.pom
[JENKINS] Archiving <https://builds.apache.org/job/httpcomponents-client-4.5.x/ws/httpmime/pom.xml>
to org.apache.httpcomponents/httpmime/4.5.4-SNAPSHOT/httpmime-4.5.4-SNAPSHOT.pom
channel stopped

Mime
View raw message