hc-commits mailing list archives

Site index · List index
Message view « Date » · « Thread »
Top « Date » · « Thread »
From Apache Jenkins Server <jenk...@builds.apache.org>
Subject Build failed in Jenkins: httpcomponents-core-4.4.x #183
Date Fri, 11 Aug 2017 15:33:48 GMT
See <https://builds.apache.org/job/httpcomponents-core-4.4.x/183/display/redirect?page=changes>

Changes:

[olegk] HTTPCORE-481: async request executor to treat non-error (status >= 200

------------------------------------------
[...truncated 83.40 KB...]
[WARNING] protected boolean validate(final E entry) {
[WARNING] ^
[WARNING] <https://builds.apache.org/job/httpcomponents-core-4.4.x/ws/httpcore/src/main/java/org/apache/http/pool/AbstractConnPool.java>:140:
warning: no @throws for java.io.IOException
[WARNING] public void shutdown() throws IOException {
[WARNING] ^
[WARNING] <https://builds.apache.org/job/httpcomponents-core-4.4.x/ws/httpcore/src/main/java/org/apache/http/pool/AbstractConnPool.java>:557:
warning: no @param for callback
[WARNING] protected void enumAvailable(final PoolEntryCallback<T, C> callback) {
[WARNING] ^
[WARNING] <https://builds.apache.org/job/httpcomponents-core-4.4.x/ws/httpcore/src/main/java/org/apache/http/pool/AbstractConnPool.java>:581:
warning: no @param for callback
[WARNING] protected void enumLeased(final PoolEntryCallback<T, C> callback) {
[WARNING] ^
[WARNING] <https://builds.apache.org/job/httpcomponents-core-4.4.x/ws/httpcore/src/main/java/org/apache/http/pool/PoolEntry.java>:127:
warning: no @return
[WARNING] public long getValidityDeadline() {
[WARNING] ^
[WARNING] <https://builds.apache.org/job/httpcomponents-core-4.4.x/ws/httpcore/src/main/java/org/apache/http/pool/PoolEntry.java>:135:
warning: no @return
[WARNING] public long getValidUnit() {
[WARNING] ^
[WARNING] <https://builds.apache.org/job/httpcomponents-core-4.4.x/ws/httpcore/src/main/java/org/apache/http/pool/PoolEntry.java>:180:
warning: no @return
[WARNING] public abstract boolean isClosed();
[WARNING] ^
[WARNING] <https://builds.apache.org/job/httpcomponents-core-4.4.x/ws/httpcore/src/main/java/org/apache/http/message/AbstractHttpMessage.java>:54:
warning: no @param for params
[WARNING] protected AbstractHttpMessage(final HttpParams params) {
[WARNING] ^
[WARNING] <https://builds.apache.org/job/httpcomponents-core-4.4.x/ws/httpcore/src/main/java/org/apache/http/message/BasicHeaderElementIterator.java>:57:
warning: no @param for headerIterator
[WARNING] public BasicHeaderElementIterator(
[WARNING] ^
[WARNING] <https://builds.apache.org/job/httpcomponents-core-4.4.x/ws/httpcore/src/main/java/org/apache/http/message/BasicHeaderElementIterator.java>:57:
warning: no @param for parser
[WARNING] public BasicHeaderElementIterator(
[WARNING] ^
[WARNING] <https://builds.apache.org/job/httpcomponents-core-4.4.x/ws/httpcore/src/main/java/org/apache/http/message/BasicHeaderValueParser.java>:163:
warning: no @param for name
[WARNING] protected HeaderElement createHeaderElement(
[WARNING] ^
[WARNING] <https://builds.apache.org/job/httpcomponents-core-4.4.x/ws/httpcore/src/main/java/org/apache/http/message/BasicHeaderValueParser.java>:163:
warning: no @param for value
[WARNING] protected HeaderElement createHeaderElement(
[WARNING] ^
[WARNING] <https://builds.apache.org/job/httpcomponents-core-4.4.x/ws/httpcore/src/main/java/org/apache/http/message/BasicHeaderValueParser.java>:163:
warning: no @param for params
[WARNING] protected HeaderElement createHeaderElement(
[WARNING] ^
[WARNING] <https://builds.apache.org/job/httpcomponents-core-4.4.x/ws/httpcore/src/main/java/org/apache/http/message/BasicHeaderValueParser.java>:260:
warning: no @param for buffer
[WARNING] public NameValuePair parseNameValuePair(final CharArrayBuffer buffer,
[WARNING] ^
[WARNING] <https://builds.apache.org/job/httpcomponents-core-4.4.x/ws/httpcore/src/main/java/org/apache/http/message/BasicHeaderValueParser.java>:260:
warning: no @param for cursor
[WARNING] public NameValuePair parseNameValuePair(final CharArrayBuffer buffer,
[WARNING] ^
[WARNING] <https://builds.apache.org/job/httpcomponents-core-4.4.x/ws/httpcore/src/main/java/org/apache/http/message/BasicHeaderValueParser.java>:260:
warning: no @param for delimiters
[WARNING] public NameValuePair parseNameValuePair(final CharArrayBuffer buffer,
[WARNING] ^
[WARNING] <https://builds.apache.org/job/httpcomponents-core-4.4.x/ws/httpcore/src/main/java/org/apache/http/message/BasicHeaderValueParser.java>:260:
warning: no @return
[WARNING] public NameValuePair parseNameValuePair(final CharArrayBuffer buffer,
[WARNING] ^
[WARNING] <https://builds.apache.org/job/httpcomponents-core-4.4.x/ws/httpcore/src/main/java/org/apache/http/message/BasicLineParser.java>:452:
warning: no @param for buffer
[WARNING] protected void skipWhitespace(final CharArrayBuffer buffer, final ParserCursor cursor)
{
[WARNING] ^
[WARNING] <https://builds.apache.org/job/httpcomponents-core-4.4.x/ws/httpcore/src/main/java/org/apache/http/message/BasicLineParser.java>:452:
warning: no @param for cursor
[WARNING] protected void skipWhitespace(final CharArrayBuffer buffer, final ParserCursor cursor)
{
[WARNING] ^
[WARNING] <https://builds.apache.org/job/httpcomponents-core-4.4.x/ws/httpcore/src/main/java/org/apache/http/message/TokenParser.java>:88:
warning: no @return
[WARNING] public String parseToken(final CharArrayBuffer buf, final ParserCursor cursor, final
BitSet delimiters) {
[WARNING] ^
[WARNING] <https://builds.apache.org/job/httpcomponents-core-4.4.x/ws/httpcore/src/main/java/org/apache/http/message/TokenParser.java>:119:
warning: no @return
[WARNING] public String parseValue(final CharArrayBuffer buf, final ParserCursor cursor, final
BitSet delimiters) {
[WARNING] ^
[WARNING] <https://builds.apache.org/job/httpcomponents-core-4.4.x/ws/httpcore/src/main/java/org/apache/http/config/SocketConfig.java>:266:
warning: no @param for sndBufSize
[WARNING] public Builder setSndBufSize(final int sndBufSize) {
[WARNING] ^
[WARNING] <https://builds.apache.org/job/httpcomponents-core-4.4.x/ws/httpcore/src/main/java/org/apache/http/config/SocketConfig.java>:266:
warning: no @return
[WARNING] public Builder setSndBufSize(final int sndBufSize) {
[WARNING] ^
[WARNING] <https://builds.apache.org/job/httpcomponents-core-4.4.x/ws/httpcore/src/main/java/org/apache/http/config/SocketConfig.java>:274:
warning: no @param for rcvBufSize
[WARNING] public Builder setRcvBufSize(final int rcvBufSize) {
[WARNING] ^
[WARNING] <https://builds.apache.org/job/httpcomponents-core-4.4.x/ws/httpcore/src/main/java/org/apache/http/config/SocketConfig.java>:274:
warning: no @return
[WARNING] public Builder setRcvBufSize(final int rcvBufSize) {
[WARNING] ^
[WARNING] <https://builds.apache.org/job/httpcomponents-core-4.4.x/ws/httpcore/src/main/java/org/apache/http/config/SocketConfig.java>:282:
warning: no @param for backlogSize
[WARNING] public Builder setBacklogSize(final int backlogSize) {
[WARNING] ^
[WARNING] <https://builds.apache.org/job/httpcomponents-core-4.4.x/ws/httpcore/src/main/java/org/apache/http/config/SocketConfig.java>:282:
warning: no @return
[WARNING] public Builder setBacklogSize(final int backlogSize) {
[WARNING] ^
[WARNING] <https://builds.apache.org/job/httpcomponents-core-4.4.x/ws/httpcore/src/main/java/org/apache/http/io/HttpTransportMetrics.java>:41:
warning: no @return
[WARNING] long getBytesTransferred();
[WARNING] ^
[WARNING] <https://builds.apache.org/job/httpcomponents-core-4.4.x/ws/httpcore/src/main/java/org/apache/http/util/TextUtils.java>:38:
warning: no @param for s
[WARNING] public static boolean isEmpty(final CharSequence s) {
[WARNING] ^
[WARNING] <https://builds.apache.org/job/httpcomponents-core-4.4.x/ws/httpcore/src/main/java/org/apache/http/util/TextUtils.java>:38:
warning: no @return
[WARNING] public static boolean isEmpty(final CharSequence s) {
[WARNING] ^
[WARNING] <https://builds.apache.org/job/httpcomponents-core-4.4.x/ws/httpcore/src/main/java/org/apache/http/util/TextUtils.java>:48:
warning: no @param for s
[WARNING] public static boolean isBlank(final CharSequence s) {
[WARNING] ^
[WARNING] <https://builds.apache.org/job/httpcomponents-core-4.4.x/ws/httpcore/src/main/java/org/apache/http/util/TextUtils.java>:48:
warning: no @return
[WARNING] public static boolean isBlank(final CharSequence s) {
[WARNING] ^
[WARNING] <https://builds.apache.org/job/httpcomponents-core-4.4.x/ws/httpcore/src/main/java/org/apache/http/util/TextUtils.java>:63:
warning: no @param for s
[WARNING] public static boolean containsBlanks(final CharSequence s) {
[WARNING] ^
[WARNING] <https://builds.apache.org/job/httpcomponents-core-4.4.x/ws/httpcore/src/main/java/org/apache/http/util/TextUtils.java>:63:
warning: no @return
[WARNING] public static boolean containsBlanks(final CharSequence s) {
[WARNING] ^
[WARNING] <https://builds.apache.org/job/httpcomponents-core-4.4.x/ws/httpcore/src/main/java/org/apache/http/util/VersionInfo.java>:317:
warning: no @return
[WARNING] public static String getUserAgent(final String name, final String pkg, final Class<?>
cls) {
[WARNING] ^
[WARNING] <https://builds.apache.org/job/httpcomponents-core-4.4.x/ws/httpcore/src/main/java-deprecated/org/apache/http/impl/AbstractHttpClientConnection.java>:197:
warning: no @param for inTransportMetric
[WARNING] protected HttpConnectionMetricsImpl createConnectionMetrics(
[WARNING] ^
[WARNING] <https://builds.apache.org/job/httpcomponents-core-4.4.x/ws/httpcore/src/main/java-deprecated/org/apache/http/impl/AbstractHttpClientConnection.java>:197:
warning: no @param for outTransportMetric
[WARNING] protected HttpConnectionMetricsImpl createConnectionMetrics(
[WARNING] ^
[WARNING] <https://builds.apache.org/job/httpcomponents-core-4.4.x/ws/httpcore/src/main/java-deprecated/org/apache/http/impl/AbstractHttpClientConnection.java>:197:
warning: no @return
[WARNING] protected HttpConnectionMetricsImpl createConnectionMetrics(
[WARNING] ^
[WARNING] <https://builds.apache.org/job/httpcomponents-core-4.4.x/ws/httpcore/src/main/java-deprecated/org/apache/http/impl/AbstractHttpServerConnection.java>:197:
warning: no @param for inTransportMetric
[WARNING] protected HttpConnectionMetricsImpl createConnectionMetrics(
[WARNING] ^
[WARNING] <https://builds.apache.org/job/httpcomponents-core-4.4.x/ws/httpcore/src/main/java-deprecated/org/apache/http/impl/AbstractHttpServerConnection.java>:197:
warning: no @param for outTransportMetric
[WARNING] protected HttpConnectionMetricsImpl createConnectionMetrics(
[WARNING] ^
[WARNING] <https://builds.apache.org/job/httpcomponents-core-4.4.x/ws/httpcore/src/main/java-deprecated/org/apache/http/impl/AbstractHttpServerConnection.java>:197:
warning: no @return
[WARNING] protected HttpConnectionMetricsImpl createConnectionMetrics(
[WARNING] ^
[WARNING] <https://builds.apache.org/job/httpcomponents-core-4.4.x/ws/httpcore/src/main/java/org/apache/http/impl/bootstrap/ServerBootstrap.java>:97:
warning: no @param for listenerPort
[WARNING] public final ServerBootstrap setListenerPort(final int listenerPort) {
[WARNING] ^
[WARNING] <https://builds.apache.org/job/httpcomponents-core-4.4.x/ws/httpcore/src/main/java/org/apache/http/impl/bootstrap/ServerBootstrap.java>:97:
warning: no @return
[WARNING] public final ServerBootstrap setListenerPort(final int listenerPort) {
[WARNING] ^
[WARNING] <https://builds.apache.org/job/httpcomponents-core-4.4.x/ws/httpcore/src/main/java/org/apache/http/impl/bootstrap/ServerBootstrap.java>:105:
warning: no @param for localAddress
[WARNING] public final ServerBootstrap setLocalAddress(final InetAddress localAddress) {
[WARNING] ^
[WARNING] <https://builds.apache.org/job/httpcomponents-core-4.4.x/ws/httpcore/src/main/java/org/apache/http/impl/bootstrap/ServerBootstrap.java>:105:
warning: no @return
[WARNING] public final ServerBootstrap setLocalAddress(final InetAddress localAddress) {
[WARNING] ^
[INFO] Building jar: <https://builds.apache.org/job/httpcomponents-core-4.4.x/ws/httpcore/target/httpcore-4.4.7-SNAPSHOT-javadoc.jar>
[INFO] 
[INFO] --- maven-site-plugin:3.3:attach-descriptor (attach-descriptor) @ httpcore ---
[INFO] 
[INFO] --- maven-jar-plugin:2.6:test-jar (default) @ httpcore ---
[INFO] Building jar: <https://builds.apache.org/job/httpcomponents-core-4.4.x/ws/httpcore/target/httpcore-4.4.7-SNAPSHOT-tests.jar>
[INFO] 
[INFO] --- apache-rat-plugin:0.12:check (default) @ httpcore ---
[INFO] Enabled default license matchers.
[INFO] Will parse SCM ignores for exclusions...
[INFO] Finished adding exclusions from SCM ignore files.
[INFO] 61 implicit excludes (use -debug for more details).
[INFO] Exclude: **/.externalToolBuilders/**
[INFO] Exclude: **/.pmd
[INFO] Exclude: **/maven-eclipse.xml
[INFO] Exclude: **/.checkstyle
[INFO] Exclude: src/docbkx/resources/**
[INFO] Exclude: src/test/resources/*.truststore
[INFO] 358 resources included (use -debug for more details)
[INFO] Rat check: Summary over all files. Unapproved: 0, unknown: 0, generated: 0, approved:
352 licenses.
[INFO] 
[INFO] --- maven-install-plugin:2.4:install (default-install) @ httpcore ---
[INFO] Installing <https://builds.apache.org/job/httpcomponents-core-4.4.x/ws/httpcore/target/httpcore-4.4.7-SNAPSHOT.jar>
to /home/jenkins/jenkins-slave/maven-repositories/1/org/apache/httpcomponents/httpcore/4.4.7-SNAPSHOT/httpcore-4.4.7-SNAPSHOT.jar
[INFO] Installing <https://builds.apache.org/job/httpcomponents-core-4.4.x/ws/httpcore/pom.xml>
to /home/jenkins/jenkins-slave/maven-repositories/1/org/apache/httpcomponents/httpcore/4.4.7-SNAPSHOT/httpcore-4.4.7-SNAPSHOT.pom
[INFO] Installing <https://builds.apache.org/job/httpcomponents-core-4.4.x/ws/httpcore/target/httpcore-4.4.7-SNAPSHOT-sources.jar>
to /home/jenkins/jenkins-slave/maven-repositories/1/org/apache/httpcomponents/httpcore/4.4.7-SNAPSHOT/httpcore-4.4.7-SNAPSHOT-sources.jar
[INFO] Installing <https://builds.apache.org/job/httpcomponents-core-4.4.x/ws/httpcore/target/httpcore-4.4.7-SNAPSHOT-javadoc.jar>
to /home/jenkins/jenkins-slave/maven-repositories/1/org/apache/httpcomponents/httpcore/4.4.7-SNAPSHOT/httpcore-4.4.7-SNAPSHOT-javadoc.jar
[INFO] Installing <https://builds.apache.org/job/httpcomponents-core-4.4.x/ws/httpcore/target/httpcore-4.4.7-SNAPSHOT-tests.jar>
to /home/jenkins/jenkins-slave/maven-repositories/1/org/apache/httpcomponents/httpcore/4.4.7-SNAPSHOT/httpcore-4.4.7-SNAPSHOT-tests.jar
[INFO] 
[INFO] >>> clirr-maven-plugin:2.5:check (default-cli) > compile @ httpcore >>>
[INFO] 
[INFO] --- maven-checkstyle-plugin:2.9.1:checkstyle (validate) @ httpcore ---
[INFO] Starting audit...
Audit done.

[INFO] 
[INFO] --- maven-checkstyle-plugin:2.9.1:checkstyle (validate-main) @ httpcore ---
[INFO] Starting audit...
Audit done.

[INFO] 
[INFO] --- maven-checkstyle-plugin:2.9.1:checkstyle (validate-test) @ httpcore ---
[INFO] Starting audit...
Audit done.

[INFO] 
[INFO] --- maven-checkstyle-plugin:2.9.1:checkstyle (validate-examples) @ httpcore ---
[INFO] Starting audit...
Audit done.

[INFO] 
[INFO] --- build-helper-maven-plugin:1.8:add-source (add-source) @ httpcore ---
[INFO] Source directory: <https://builds.apache.org/job/httpcomponents-core-4.4.x/ws/httpcore/src/main/java-deprecated>
added.
[INFO] 
[INFO] --- maven-remote-resources-plugin:1.4:process (default) @ httpcore ---
[INFO] 
[INFO] --- buildnumber-maven-plugin:1.2:create (default) @ httpcore ---
[INFO] Checking for local modifications: skipped.
[INFO] Updating project files from SCM: skipped.
[INFO] Executing: /bin/sh -c cd <https://builds.apache.org/job/httpcomponents-core-4.4.x/ws/httpcore>
&& git rev-parse --verify HEAD
[INFO] Working directory: <https://builds.apache.org/job/httpcomponents-core-4.4.x/ws/httpcore>
[INFO] Storing buildNumber: null at timestamp: 1502465610464
[INFO] Executing: /bin/sh -c cd <https://builds.apache.org/job/httpcomponents-core-4.4.x/ws/httpcore>
&& git rev-parse --verify HEAD
[INFO] Working directory: <https://builds.apache.org/job/httpcomponents-core-4.4.x/ws/httpcore>
[INFO] Storing buildScmBranch: UNKNOWN
[INFO] 
[INFO] --- maven-resources-plugin:2.6:resources (default-resources) @ httpcore ---
[INFO] Using 'UTF-8' encoding to copy filtered resources.
[INFO] Copying 1 resource
[INFO] Copying 3 resources
[INFO] Copying 3 resources
[INFO] 
[INFO] --- maven-compiler-plugin:3.1:compile (default-compile) @ httpcore ---
[INFO] Changes detected - recompiling the module!
[INFO] Compiling 256 source files to <https://builds.apache.org/job/httpcomponents-core-4.4.x/ws/httpcore/target/classes>
[WARNING] Failed to getClass for org.codehaus.mojo.clirr.ClirrCheckMojo
[INFO] 
[INFO] <<< clirr-maven-plugin:2.5:check (default-cli) < compile @ httpcore <<<
[INFO] 
[INFO] --- clirr-maven-plugin:2.5:check (default-cli) @ httpcore ---
[INFO] Comparing to version: 4.4
[INFO] ------------------------------------------------------------------------
[INFO] Reactor Summary:
[INFO] 
[INFO] Apache HttpComponents Core ......................... SUCCESS [ 13.376 s]
[INFO] Apache HttpCore .................................... FAILURE [ 55.475 s]
[INFO] Apache HttpCore NIO ................................ SKIPPED
[INFO] Apache HttpCore OSGi bundle ........................ SKIPPED
[INFO] Apache HttpCore Benchmarking Tool .................. SKIPPED
[INFO] ------------------------------------------------------------------------
[INFO] BUILD FAILURE
[INFO] ------------------------------------------------------------------------
[INFO] Total time: 01:21 min
[INFO] Finished at: 2017-08-11T15:33:42+00:00
[INFO] Final Memory: 50M/790M
[INFO] ------------------------------------------------------------------------
[ERROR] Failed to execute goal org.codehaus.mojo:clirr-maven-plugin:2.5:check (default-cli)
on project httpcore: Execution default-cli of goal org.codehaus.mojo:clirr-maven-plugin:2.5:check
failed: Invalid byte tag in constant pool: 18 -> [Help 1]
[ERROR] 
[ERROR] To see the full stack trace of the errors, re-run Maven with the -e switch.
[ERROR] Re-run Maven using the -X switch to enable full debug logging.
[ERROR] 
[ERROR] For more information about the errors and possible solutions, please read the following
articles:
[ERROR] [Help 1] http://cwiki.apache.org/confluence/display/MAVEN/PluginExecutionException
[ERROR] 
[ERROR] After correcting the problems, you can resume the build with the command
[ERROR]   mvn <goals> -rf :httpcore
[JENKINS] Archiving <https://builds.apache.org/job/httpcomponents-core-4.4.x/ws/httpcore/pom.xml>
to org.apache.httpcomponents/httpcore/4.4.7-SNAPSHOT/httpcore-4.4.7-SNAPSHOT.pom
[JENKINS] Archiving <https://builds.apache.org/job/httpcomponents-core-4.4.x/ws/httpcore/target/httpcore-4.4.7-SNAPSHOT.jar>
to org.apache.httpcomponents/httpcore/4.4.7-SNAPSHOT/httpcore-4.4.7-SNAPSHOT.jar
[JENKINS] Archiving <https://builds.apache.org/job/httpcomponents-core-4.4.x/ws/httpcore/target/httpcore-4.4.7-SNAPSHOT-sources.jar>
to org.apache.httpcomponents/httpcore/4.4.7-SNAPSHOT/httpcore-4.4.7-SNAPSHOT-sources.jar
[JENKINS] Archiving <https://builds.apache.org/job/httpcomponents-core-4.4.x/ws/httpcore/target/httpcore-4.4.7-SNAPSHOT-javadoc.jar>
to org.apache.httpcomponents/httpcore/4.4.7-SNAPSHOT/httpcore-4.4.7-SNAPSHOT-javadoc.jar
[JENKINS] Archiving <https://builds.apache.org/job/httpcomponents-core-4.4.x/ws/httpcore/target/httpcore-4.4.7-SNAPSHOT-tests.jar>
to org.apache.httpcomponents/httpcore/4.4.7-SNAPSHOT/httpcore-4.4.7-SNAPSHOT-tests.jar
[JENKINS] Archiving <https://builds.apache.org/job/httpcomponents-core-4.4.x/ws/httpcore-osgi/pom.xml>
to org.apache.httpcomponents/httpcore-osgi/4.4.7-SNAPSHOT/httpcore-osgi-4.4.7-SNAPSHOT.pom
[JENKINS] Archiving <https://builds.apache.org/job/httpcomponents-core-4.4.x/ws/httpcore-ab/pom.xml>
to org.apache.httpcomponents/httpcore-ab/4.4.7-SNAPSHOT/httpcore-ab-4.4.7-SNAPSHOT.pom
[JENKINS] Archiving <https://builds.apache.org/job/httpcomponents-core-4.4.x/ws/pom.xml>
to org.apache.httpcomponents/httpcomponents-core/4.4.7-SNAPSHOT/httpcomponents-core-4.4.7-SNAPSHOT.pom
[JENKINS] Archiving <https://builds.apache.org/job/httpcomponents-core-4.4.x/ws/httpcore-nio/pom.xml>
to org.apache.httpcomponents/httpcore-nio/4.4.7-SNAPSHOT/httpcore-nio-4.4.7-SNAPSHOT.pom
channel stopped

Mime
View raw message