hc-commits mailing list archives

Site index · List index
Message view « Date » · « Thread »
Top « Date » · « Thread »
From Apache Jenkins Server <jenk...@builds.apache.org>
Subject Build failed in Jenkins: httpcomponents-core-4.4.x #164
Date Wed, 10 May 2017 12:04:29 GMT
See <https://builds.apache.org/job/httpcomponents-core-4.4.x/164/display/redirect?page=changes>

Changes:

[ggregory] HTTPCORE-465: Update example NHttpReverseProxy to support SSL to origin servers
which use self-signed certificates.

------------------------------------------
[...truncated 26.72 KB...]
Tests run: 9, Failures: 0, Errors: 0, Skipped: 0, Time elapsed: 0.004 sec - in org.apache.http.TestHttpHost
Running org.apache.http.config.TestRegistry
Tests run: 1, Failures: 0, Errors: 0, Skipped: 0, Time elapsed: 0.001 sec - in org.apache.http.config.TestRegistry
Running org.apache.http.concurrent.TestBasicFuture
Tests run: 9, Failures: 0, Errors: 0, Skipped: 0, Time elapsed: 0.308 sec - in org.apache.http.concurrent.TestBasicFuture
Running org.apache.http.util.TestArgs
Tests run: 25, Failures: 0, Errors: 0, Skipped: 0, Time elapsed: 0.014 sec - in org.apache.http.util.TestArgs
Running org.apache.http.util.TestEncodingUtils
Tests run: 5, Failures: 0, Errors: 0, Skipped: 0, Time elapsed: 0.002 sec - in org.apache.http.util.TestEncodingUtils
Running org.apache.http.util.TestTextUtils
Tests run: 3, Failures: 0, Errors: 0, Skipped: 0, Time elapsed: 0.001 sec - in org.apache.http.util.TestTextUtils
Running org.apache.http.util.TestAsserts
Tests run: 8, Failures: 0, Errors: 0, Skipped: 0, Time elapsed: 0.004 sec - in org.apache.http.util.TestAsserts
Running org.apache.http.util.TestLangUtils
Tests run: 5, Failures: 0, Errors: 0, Skipped: 0, Time elapsed: 0.005 sec - in org.apache.http.util.TestLangUtils
Running org.apache.http.util.TestEntityUtils
Tests run: 14, Failures: 0, Errors: 0, Skipped: 0, Time elapsed: 0.003 sec - in org.apache.http.util.TestEntityUtils
Running org.apache.http.util.TestCharArrayBuffer
Tests run: 22, Failures: 0, Errors: 0, Skipped: 0, Time elapsed: 0.009 sec - in org.apache.http.util.TestCharArrayBuffer
Running org.apache.http.util.TestByteArrayBuffer
Tests run: 15, Failures: 0, Errors: 0, Skipped: 0, Time elapsed: 0.008 sec - in org.apache.http.util.TestByteArrayBuffer
Running org.apache.http.impl.TestDefaultBHttpClientConnection
Tests run: 5, Failures: 0, Errors: 0, Skipped: 0, Time elapsed: 0.06 sec - in org.apache.http.impl.TestDefaultBHttpClientConnection
Running org.apache.http.impl.TestBHttpConnectionBase
Tests run: 22, Failures: 0, Errors: 0, Skipped: 0, Time elapsed: 0.052 sec - in org.apache.http.impl.TestBHttpConnectionBase
Running org.apache.http.impl.TestEnglishReasonPhraseCatalog
Tests run: 3, Failures: 0, Errors: 0, Skipped: 0, Time elapsed: 0.002 sec - in org.apache.http.impl.TestEnglishReasonPhraseCatalog
Running org.apache.http.impl.entity.TestStrictContentLengthStrategy
Tests run: 8, Failures: 0, Errors: 0, Skipped: 0, Time elapsed: 0.003 sec - in org.apache.http.impl.entity.TestStrictContentLengthStrategy
Running org.apache.http.impl.entity.TestDisallowIdentityContentLengthStrategy
Tests run: 2, Failures: 0, Errors: 0, Skipped: 0, Time elapsed: 0.004 sec - in org.apache.http.impl.entity.TestDisallowIdentityContentLengthStrategy
Running org.apache.http.impl.entity.TestLaxContentLengthStrategy
Tests run: 10, Failures: 0, Errors: 0, Skipped: 0, Time elapsed: 0.003 sec - in org.apache.http.impl.entity.TestLaxContentLengthStrategy
Running org.apache.http.impl.TestBasicRequest
Tests run: 2, Failures: 0, Errors: 0, Skipped: 0, Time elapsed: 0 sec - in org.apache.http.impl.TestBasicRequest
Running org.apache.http.impl.pool.TestBasicConnPool
Tests run: 4, Failures: 0, Errors: 0, Skipped: 0, Time elapsed: 0.024 sec - in org.apache.http.impl.pool.TestBasicConnPool
Running org.apache.http.impl.TestDefaultBHttpServerConnection
Tests run: 6, Failures: 0, Errors: 0, Skipped: 0, Time elapsed: 0.01 sec - in org.apache.http.impl.TestDefaultBHttpServerConnection
Running org.apache.http.impl.TestDefaultConnectionReuseStrategy
Tests run: 27, Failures: 0, Errors: 0, Skipped: 0, Time elapsed: 0.011 sec - in org.apache.http.impl.TestDefaultConnectionReuseStrategy
Running org.apache.http.impl.io.TestSessionInOutBuffers
Tests run: 21, Failures: 0, Errors: 0, Skipped: 0, Time elapsed: 0.077 sec - in org.apache.http.impl.io.TestSessionInOutBuffers
Running org.apache.http.impl.io.TestMessageParser
Tests run: 8, Failures: 0, Errors: 0, Skipped: 0, Time elapsed: 0.003 sec - in org.apache.http.impl.io.TestMessageParser
Running org.apache.http.impl.io.TestChunkCoding
Tests run: 25, Failures: 0, Errors: 0, Skipped: 0, Time elapsed: 0.012 sec - in org.apache.http.impl.io.TestChunkCoding
Running org.apache.http.impl.io.TestRequestParser
Tests run: 4, Failures: 0, Errors: 0, Skipped: 0, Time elapsed: 0.001 sec - in org.apache.http.impl.io.TestRequestParser
Running org.apache.http.impl.io.TestIdentityOutputStream
Tests run: 6, Failures: 0, Errors: 0, Skipped: 0, Time elapsed: 0.001 sec - in org.apache.http.impl.io.TestIdentityOutputStream
Running org.apache.http.impl.io.TestResponseParser
Tests run: 4, Failures: 0, Errors: 0, Skipped: 0, Time elapsed: 0.001 sec - in org.apache.http.impl.io.TestResponseParser
Running org.apache.http.impl.io.TestIdentityInputStream
Tests run: 4, Failures: 0, Errors: 0, Skipped: 0, Time elapsed: 0.003 sec - in org.apache.http.impl.io.TestIdentityInputStream
Running org.apache.http.impl.io.TestContentLengthOutputStream
Tests run: 3, Failures: 0, Errors: 0, Skipped: 0, Time elapsed: 0 sec - in org.apache.http.impl.io.TestContentLengthOutputStream
Running org.apache.http.impl.io.TestContentLengthInputStream
Tests run: 6, Failures: 0, Errors: 0, Skipped: 0, Time elapsed: 0 sec - in org.apache.http.impl.io.TestContentLengthInputStream
Running org.apache.http.impl.TestNoConnectionReuseStrategy
Tests run: 1, Failures: 0, Errors: 0, Skipped: 0, Time elapsed: 0.016 sec - in org.apache.http.impl.TestNoConnectionReuseStrategy
Running org.apache.http.integration.TestSyncHttp
Tests run: 11, Failures: 0, Errors: 0, Skipped: 0, Time elapsed: 2.771 sec - in org.apache.http.integration.TestSyncHttp

Results :

Tests run: 651, Failures: 0, Errors: 0, Skipped: 0

[JENKINS] Recording test results
[INFO] 
[INFO] --- maven-jar-plugin:2.6:jar (default-jar) @ httpcore ---
[INFO] Building jar: <https://builds.apache.org/job/httpcomponents-core-4.4.x/ws/httpcore-4.4.x/httpcore/target/httpcore-4.4.7-SNAPSHOT.jar>
[INFO] 
[INFO] --- maven-checkstyle-plugin:2.9.1:checkstyle (validate) @ httpcore ---
[INFO] Starting audit...
Audit done.

[INFO] 
[INFO] --- maven-checkstyle-plugin:2.9.1:checkstyle (validate-main) @ httpcore ---
[INFO] Starting audit...
Audit done.

[INFO] 
[INFO] --- maven-checkstyle-plugin:2.9.1:checkstyle (validate-test) @ httpcore ---
[INFO] Starting audit...
Audit done.

[INFO] 
[INFO] --- maven-checkstyle-plugin:2.9.1:checkstyle (validate-examples) @ httpcore ---
[INFO] Starting audit...
Audit done.

[INFO] 
[INFO] --- build-helper-maven-plugin:1.8:add-source (add-source) @ httpcore ---
[INFO] Source directory: <https://builds.apache.org/job/httpcomponents-core-4.4.x/ws/httpcore-4.4.x/httpcore/src/main/java-deprecated>
added.
[WARNING] Failed to getClass for org.apache.maven.plugin.source.SourceJarMojo
[INFO] 
[INFO] --- maven-source-plugin:2.2.1:jar (attach-sources) @ httpcore ---
[INFO] Building jar: <https://builds.apache.org/job/httpcomponents-core-4.4.x/ws/httpcore-4.4.x/httpcore/target/httpcore-4.4.7-SNAPSHOT-sources.jar>
[INFO] 
[INFO] --- maven-javadoc-plugin:2.9.1:jar (attach-javadocs) @ httpcore ---
[INFO] 
1 warning
[WARNING] Javadoc Warnings
[WARNING] warning: [options] bootstrap class path not set in conjunction with -source 1.6
[INFO] Building jar: <https://builds.apache.org/job/httpcomponents-core-4.4.x/ws/httpcore-4.4.x/httpcore/target/httpcore-4.4.7-SNAPSHOT-javadoc.jar>
[INFO] 
[INFO] --- maven-site-plugin:3.3:attach-descriptor (attach-descriptor) @ httpcore ---
[INFO] 
[INFO] --- maven-jar-plugin:2.6:test-jar (default) @ httpcore ---
[INFO] Building jar: <https://builds.apache.org/job/httpcomponents-core-4.4.x/ws/httpcore-4.4.x/httpcore/target/httpcore-4.4.7-SNAPSHOT-tests.jar>
[INFO] 
[INFO] --- apache-rat-plugin:0.12:check (default) @ httpcore ---
[INFO] Enabled default license matchers.
[INFO] Will parse SCM ignores for exclusions...
[INFO] Finished adding exclusions from SCM ignore files.
[INFO] 61 implicit excludes (use -debug for more details).
[INFO] Exclude: **/.externalToolBuilders/**
[INFO] Exclude: **/.pmd
[INFO] Exclude: **/maven-eclipse.xml
[INFO] Exclude: **/.checkstyle
[INFO] Exclude: src/docbkx/resources/**
[INFO] Exclude: src/test/resources/*.truststore
[INFO] 357 resources included (use -debug for more details)
[INFO] Rat check: Summary over all files. Unapproved: 0, unknown: 0, generated: 0, approved:
351 licenses.
[INFO] 
[INFO] --- maven-install-plugin:2.4:install (default-install) @ httpcore ---
[INFO] Installing <https://builds.apache.org/job/httpcomponents-core-4.4.x/ws/httpcore-4.4.x/httpcore/target/httpcore-4.4.7-SNAPSHOT.jar>
to /home/jenkins/jenkins-slave/maven-repositories/1/org/apache/httpcomponents/httpcore/4.4.7-SNAPSHOT/httpcore-4.4.7-SNAPSHOT.jar
[INFO] Installing <https://builds.apache.org/job/httpcomponents-core-4.4.x/ws/httpcore-4.4.x/httpcore/pom.xml>
to /home/jenkins/jenkins-slave/maven-repositories/1/org/apache/httpcomponents/httpcore/4.4.7-SNAPSHOT/httpcore-4.4.7-SNAPSHOT.pom
[INFO] Installing <https://builds.apache.org/job/httpcomponents-core-4.4.x/ws/httpcore-4.4.x/httpcore/target/httpcore-4.4.7-SNAPSHOT-sources.jar>
to /home/jenkins/jenkins-slave/maven-repositories/1/org/apache/httpcomponents/httpcore/4.4.7-SNAPSHOT/httpcore-4.4.7-SNAPSHOT-sources.jar
[INFO] Installing <https://builds.apache.org/job/httpcomponents-core-4.4.x/ws/httpcore-4.4.x/httpcore/target/httpcore-4.4.7-SNAPSHOT-javadoc.jar>
to /home/jenkins/jenkins-slave/maven-repositories/1/org/apache/httpcomponents/httpcore/4.4.7-SNAPSHOT/httpcore-4.4.7-SNAPSHOT-javadoc.jar
[INFO] Installing <https://builds.apache.org/job/httpcomponents-core-4.4.x/ws/httpcore-4.4.x/httpcore/target/httpcore-4.4.7-SNAPSHOT-tests.jar>
to /home/jenkins/jenkins-slave/maven-repositories/1/org/apache/httpcomponents/httpcore/4.4.7-SNAPSHOT/httpcore-4.4.7-SNAPSHOT-tests.jar
[INFO] 
[INFO] --- maven-checkstyle-plugin:2.9.1:checkstyle (validate) @ httpcore ---
[INFO] Starting audit...
Audit done.

[INFO] 
[INFO] --- maven-checkstyle-plugin:2.9.1:checkstyle (validate-main) @ httpcore ---
[INFO] Starting audit...
Audit done.

[INFO] 
[INFO] --- maven-checkstyle-plugin:2.9.1:checkstyle (validate-test) @ httpcore ---
[INFO] Starting audit...
Audit done.

[INFO] 
[INFO] --- maven-checkstyle-plugin:2.9.1:checkstyle (validate-examples) @ httpcore ---
[INFO] Starting audit...
Audit done.

[INFO] 
[INFO] --- build-helper-maven-plugin:1.8:add-source (add-source) @ httpcore ---
[INFO] Source directory: <https://builds.apache.org/job/httpcomponents-core-4.4.x/ws/httpcore-4.4.x/httpcore/src/main/java-deprecated>
added.
[INFO] 
[INFO] --- maven-remote-resources-plugin:1.4:process (default) @ httpcore ---
[INFO] 
[INFO] --- buildnumber-maven-plugin:1.2:create (default) @ httpcore ---
[INFO] Checking for local modifications: skipped.
[INFO] Updating project files from SCM: skipped.
[INFO] Executing: /bin/sh -c cd <https://builds.apache.org/job/httpcomponents-core-4.4.x/ws/httpcore-4.4.x/httpcore>
&& svn --non-interactive info
[INFO] Working directory: <https://builds.apache.org/job/httpcomponents-core-4.4.x/ws/httpcore-4.4.x/httpcore>
[INFO] Storing buildNumber: 1794648 at timestamp: 1494417767605
[INFO] Executing: /bin/sh -c cd <https://builds.apache.org/job/httpcomponents-core-4.4.x/ws/httpcore-4.4.x/httpcore>
&& svn --non-interactive info
[INFO] Working directory: <https://builds.apache.org/job/httpcomponents-core-4.4.x/ws/httpcore-4.4.x/httpcore>
[INFO] Storing buildScmBranch: branches/4.4.x/httpcore
[INFO] 
[INFO] --- maven-resources-plugin:2.6:resources (default-resources) @ httpcore ---
[INFO] Using 'UTF-8' encoding to copy filtered resources.
[INFO] Copying 1 resource
[INFO] Copying 3 resources
[INFO] Copying 3 resources
[INFO] 
[INFO] --- maven-compiler-plugin:3.1:compile (default-compile) @ httpcore ---
[INFO] Changes detected - recompiling the module!
[INFO] Compiling 256 source files to <https://builds.apache.org/job/httpcomponents-core-4.4.x/ws/httpcore-4.4.x/httpcore/target/classes>
[WARNING] <https://builds.apache.org/job/httpcomponents-core-4.4.x/ws/httpcore-4.4.x/httpcore/src/main/java-deprecated/org/apache/http/impl/io/AbstractSessionOutputBuffer.java>:
Some input files use or override a deprecated API.
[WARNING] <https://builds.apache.org/job/httpcomponents-core-4.4.x/ws/httpcore-4.4.x/httpcore/src/main/java-deprecated/org/apache/http/impl/io/AbstractSessionOutputBuffer.java>:
Recompile with -Xlint:deprecation for details.
[WARNING] Failed to getClass for org.codehaus.mojo.clirr.ClirrCheckMojo
[INFO] 
[INFO] --- clirr-maven-plugin:2.5:check (default-cli) @ httpcore ---
[INFO] Comparing to version: 4.4
[INFO] Succeeded with 0 errors; 0 warnings; and 8 other changes.
[INFO]                                                                         
[INFO] ------------------------------------------------------------------------
[INFO] Building Apache HttpCore NIO 4.4.7-SNAPSHOT
[INFO] ------------------------------------------------------------------------
[INFO] 
[INFO] --- maven-clean-plugin:2.5:clean (default-clean) @ httpcore-nio ---
[INFO] Deleting <https://builds.apache.org/job/httpcomponents-core-4.4.x/ws/httpcore-4.4.x/httpcore-nio/target>
[INFO] 
[INFO] --- maven-checkstyle-plugin:2.9.1:checkstyle (validate) @ httpcore-nio ---
[INFO] Starting audit...
Audit done.

[INFO] 
[INFO] --- maven-checkstyle-plugin:2.9.1:checkstyle (validate-main) @ httpcore-nio ---
[INFO] Starting audit...
Audit done.

[INFO] 
[INFO] --- maven-checkstyle-plugin:2.9.1:checkstyle (validate-test) @ httpcore-nio ---
[INFO] Starting audit...
Audit done.

[INFO] 
[INFO] --- maven-checkstyle-plugin:2.9.1:checkstyle (validate-examples) @ httpcore-nio ---
[INFO] Starting audit...
<https://builds.apache.org/job/httpcomponents-core-4.4.x/ws/httpcore-4.4.x/httpcore-nio/src/examples/org/apache/http/examples/nio/TrustSelfSignedStrategy.java>:37:
Trailing whitespace
Audit done.

[INFO] ------------------------------------------------------------------------
[INFO] Reactor Summary:
[INFO] 
[INFO] Apache HttpComponents Core ........................ SUCCESS [16.367s]
[INFO] Apache HttpCore ................................... SUCCESS [1:19.981s]
[INFO] Apache HttpCore NIO ............................... FAILURE [6.720s]
[INFO] Apache HttpCore OSGi bundle ....................... SKIPPED
[INFO] Apache HttpCore Benchmarking Tool ................. SKIPPED
[INFO] ------------------------------------------------------------------------
[INFO] BUILD FAILURE
[INFO] ------------------------------------------------------------------------
[INFO] Total time: 2:15.446s
[INFO] Finished at: Wed May 10 12:03:13 UTC 2017
[INFO] Final Memory: 44M/389M
[INFO] ------------------------------------------------------------------------
Waiting for Jenkins to finish collecting data
[ERROR] Failed to execute goal org.apache.maven.plugins:maven-checkstyle-plugin:2.9.1:checkstyle
(validate-examples) on project httpcore-nio: An error has occurred in Checkstyle report generation.
Failed during checkstyle execution: There are 1 checkstyle errors. -> [Help 1]
[ERROR] 
[ERROR] To see the full stack trace of the errors, re-run Maven with the -e switch.
[ERROR] Re-run Maven using the -X switch to enable full debug logging.
[ERROR] 
[ERROR] For more information about the errors and possible solutions, please read the following
articles:
[ERROR] [Help 1] http://cwiki.apache.org/confluence/display/MAVEN/MojoExecutionException
[ERROR] 
[ERROR] After correcting the problems, you can resume the build with the command
[ERROR]   mvn <goals> -rf :httpcore-nio
[JENKINS] Archiving <https://builds.apache.org/job/httpcomponents-core-4.4.x/ws/httpcore-4.4.x/httpcore/pom.xml>
to org.apache.httpcomponents/httpcore/4.4.7-SNAPSHOT/httpcore-4.4.7-SNAPSHOT.pom
[JENKINS] Archiving <https://builds.apache.org/job/httpcomponents-core-4.4.x/ws/httpcore-4.4.x/httpcore/target/httpcore-4.4.7-SNAPSHOT.jar>
to org.apache.httpcomponents/httpcore/4.4.7-SNAPSHOT/httpcore-4.4.7-SNAPSHOT.jar
[JENKINS] Archiving <https://builds.apache.org/job/httpcomponents-core-4.4.x/ws/httpcore-4.4.x/httpcore/target/httpcore-4.4.7-SNAPSHOT-sources.jar>
to org.apache.httpcomponents/httpcore/4.4.7-SNAPSHOT/httpcore-4.4.7-SNAPSHOT-sources.jar
[JENKINS] Archiving <https://builds.apache.org/job/httpcomponents-core-4.4.x/ws/httpcore-4.4.x/httpcore/target/httpcore-4.4.7-SNAPSHOT-javadoc.jar>
to org.apache.httpcomponents/httpcore/4.4.7-SNAPSHOT/httpcore-4.4.7-SNAPSHOT-javadoc.jar
[JENKINS] Archiving <https://builds.apache.org/job/httpcomponents-core-4.4.x/ws/httpcore-4.4.x/httpcore/target/httpcore-4.4.7-SNAPSHOT-tests.jar>
to org.apache.httpcomponents/httpcore/4.4.7-SNAPSHOT/httpcore-4.4.7-SNAPSHOT-tests.jar
Compressed 2.39 MB of artifacts by 13.1% relative to #163
[JENKINS] Archiving <https://builds.apache.org/job/httpcomponents-core-4.4.x/ws/httpcore-4.4.x/httpcore-osgi/pom.xml>
to org.apache.httpcomponents/httpcore-osgi/4.4.7-SNAPSHOT/httpcore-osgi-4.4.7-SNAPSHOT.pom
[JENKINS] Archiving <https://builds.apache.org/job/httpcomponents-core-4.4.x/ws/httpcore-4.4.x/httpcore-ab/pom.xml>
to org.apache.httpcomponents/httpcore-ab/4.4.7-SNAPSHOT/httpcore-ab-4.4.7-SNAPSHOT.pom
[JENKINS] Archiving <https://builds.apache.org/job/httpcomponents-core-4.4.x/ws/httpcore-4.4.x/pom.xml>
to org.apache.httpcomponents/httpcomponents-core/4.4.7-SNAPSHOT/httpcomponents-core-4.4.7-SNAPSHOT.pom
[JENKINS] Archiving <https://builds.apache.org/job/httpcomponents-core-4.4.x/ws/httpcore-4.4.x/httpcore-nio/pom.xml>
to org.apache.httpcomponents/httpcore-nio/4.4.7-SNAPSHOT/httpcore-nio-4.4.7-SNAPSHOT.pom
channel stopped

Mime
View raw message