hc-commits mailing list archives

Site index · List index
Message view « Date » · « Thread »
Top « Date » · « Thread »
From Apache Jenkins Server <jenk...@builds.apache.org>
Subject Build failed in Jenkins: httpcomponents-core-4.4.x #154
Date Fri, 05 May 2017 00:02:06 GMT
See <https://builds.apache.org/job/httpcomponents-core-4.4.x/154/display/redirect?page=changes>

Changes:

[ggregory] HTTPCORE-461: Add factory methods to DefaultHttpServerIODispatch to handle a null
SSLContext.

[ggregory] HTTPCORE-460: Add factory methods to DefaultHttpClientIODispatch to handle a null
SSLContext.

[ggregory] [HTTPCORE-450] Add a Provider parameter in SSLContextBuilder. Add SSLContextBuilder.setProvider(String).

[ggregory] Fix Javadoc typos ("SSl" -> "SSL").

[ggregory] Rename variables "sslcontext" to "sslContext".

[ggregory] Javadocs.

------------------------------------------
[...truncated 111.33 KB...]
[INFO] 
[INFO] --- maven-resources-plugin:2.6:testResources (default-testResources) @ httpcore-nio
---
[INFO] Using 'UTF-8' encoding to copy filtered resources.
[INFO] Copying 1 resource
[INFO] Copying 3 resources
[INFO] 
[INFO] --- maven-compiler-plugin:3.1:testCompile (default-testCompile) @ httpcore-nio ---
[INFO] Changes detected - recompiling the module!
[INFO] Compiling 56 source files to <https://builds.apache.org/job/httpcomponents-core-4.4.x/ws/httpcore-4.4.x/httpcore-nio/target/test-classes>
[INFO] 
[INFO] --- maven-surefire-plugin:2.15:test (default-test) @ httpcore-nio ---
[INFO] Surefire report directory: <https://builds.apache.org/job/httpcomponents-core-4.4.x/ws/httpcore-4.4.x/httpcore-nio/target/surefire-reports>

-------------------------------------------------------
 T E S T S
-------------------------------------------------------
Running org.apache.http.nio.protocol.TestBasicAsyncClientExchangeHandler
Tests run: 18, Failures: 0, Errors: 0, Skipped: 0, Time elapsed: 0.34 sec - in org.apache.http.nio.protocol.TestBasicAsyncClientExchangeHandler
Running org.apache.http.nio.protocol.TestHttpAsyncRequestExecutor
Tests run: 36, Failures: 0, Errors: 0, Skipped: 0, Time elapsed: 0.133 sec - in org.apache.http.nio.protocol.TestHttpAsyncRequestExecutor
Running org.apache.http.nio.protocol.TestHttpAsyncService
Tests run: 47, Failures: 0, Errors: 0, Skipped: 0, Time elapsed: 0.198 sec - in org.apache.http.nio.protocol.TestHttpAsyncService
Running org.apache.http.nio.protocol.TestBasicAsyncResponseConsumer
Tests run: 6, Failures: 0, Errors: 0, Skipped: 0, Time elapsed: 0.088 sec - in org.apache.http.nio.protocol.TestBasicAsyncResponseConsumer
Running org.apache.http.nio.protocol.TestUriHttpAsyncRequestHandlerMapper
Tests run: 5, Failures: 0, Errors: 0, Skipped: 0, Time elapsed: 0.026 sec - in org.apache.http.nio.protocol.TestUriHttpAsyncRequestHandlerMapper
Running org.apache.http.nio.protocol.TestBasicAsyncRequestProducer
Tests run: 11, Failures: 0, Errors: 0, Skipped: 0, Time elapsed: 0.038 sec - in org.apache.http.nio.protocol.TestBasicAsyncRequestProducer
Running org.apache.http.nio.protocol.TestErrorResponseProducer
Tests run: 2, Failures: 0, Errors: 0, Skipped: 0, Time elapsed: 0.001 sec - in org.apache.http.nio.protocol.TestErrorResponseProducer
Running org.apache.http.nio.protocol.TestBasicAsyncRequestHandler
Tests run: 3, Failures: 0, Errors: 0, Skipped: 0, Time elapsed: 0.031 sec - in org.apache.http.nio.protocol.TestBasicAsyncRequestHandler
Running org.apache.http.nio.protocol.TestBasicAsyncResponseProducer
Tests run: 5, Failures: 0, Errors: 0, Skipped: 0, Time elapsed: 0.008 sec - in org.apache.http.nio.protocol.TestBasicAsyncResponseProducer
Running org.apache.http.nio.protocol.TestBasicAsyncRequestConsumer
Tests run: 3, Failures: 0, Errors: 0, Skipped: 0, Time elapsed: 0.031 sec - in org.apache.http.nio.protocol.TestBasicAsyncRequestConsumer
Running org.apache.http.nio.protocol.TestHttpAsyncRequester
Tests run: 9, Failures: 0, Errors: 0, Skipped: 0, Time elapsed: 0.04 sec - in org.apache.http.nio.protocol.TestHttpAsyncRequester
Running org.apache.http.nio.pool.TestRouteSpecificPool
Tests run: 13, Failures: 0, Errors: 0, Skipped: 0, Time elapsed: 0.027 sec - in org.apache.http.nio.pool.TestRouteSpecificPool
Running org.apache.http.nio.pool.TestNIOConnPool
Tests run: 24, Failures: 0, Errors: 0, Skipped: 0, Time elapsed: 0.787 sec - in org.apache.http.nio.pool.TestNIOConnPool
Running org.apache.http.nio.util.TestBuffers
Tests run: 7, Failures: 0, Errors: 0, Skipped: 0, Time elapsed: 0.008 sec - in org.apache.http.nio.util.TestBuffers
Running org.apache.http.nio.integration.TestHttpAsyncHandlersPipelining
Tests run: 10, Failures: 0, Errors: 0, Skipped: 0, Time elapsed: 1.716 sec - in org.apache.http.nio.integration.TestHttpAsyncHandlersPipelining
Running org.apache.http.nio.integration.TestHttpAsyncHandlers
Tests run: 30, Failures: 0, Errors: 0, Skipped: 0, Time elapsed: 3.923 sec - in org.apache.http.nio.integration.TestHttpAsyncHandlers
Running org.apache.http.nio.integration.TestTruncatedChunks
Tests run: 2, Failures: 0, Errors: 0, Skipped: 0, Time elapsed: 0.032 sec - in org.apache.http.nio.integration.TestTruncatedChunks
Running org.apache.http.nio.integration.TestCustomSSL
Tests run: 1, Failures: 0, Errors: 0, Skipped: 0, Time elapsed: 0.035 sec - in org.apache.http.nio.integration.TestCustomSSL
Running org.apache.http.nio.integration.TestHttpAsyncHandlerCancellable
Tests run: 2, Failures: 0, Errors: 0, Skipped: 0, Time elapsed: 0.519 sec - in org.apache.http.nio.integration.TestHttpAsyncHandlerCancellable
Running org.apache.http.nio.integration.TestHttpAsyncTimeout
Tests run: 2, Failures: 0, Errors: 0, Skipped: 0, Time elapsed: 2.021 sec - in org.apache.http.nio.integration.TestHttpAsyncTimeout
Running org.apache.http.nio.integration.TestClientOutOfSequenceResponse
Tests run: 1, Failures: 0, Errors: 0, Skipped: 0, Time elapsed: 0.105 sec - in org.apache.http.nio.integration.TestClientOutOfSequenceResponse
Running org.apache.http.nio.integration.TestHttpAsyncPrematureTermination
Tests run: 3, Failures: 0, Errors: 0, Skipped: 0, Time elapsed: 0.028 sec - in org.apache.http.nio.integration.TestHttpAsyncPrematureTermination
Running org.apache.http.nio.integration.TestServerSidePipelining
Tests run: 3, Failures: 0, Errors: 0, Skipped: 0, Time elapsed: 0.023 sec - in org.apache.http.nio.integration.TestServerSidePipelining
Running org.apache.http.impl.nio.TestDefaultNHttpServerConnection
Tests run: 17, Failures: 0, Errors: 0, Skipped: 0, Time elapsed: 0.099 sec - in org.apache.http.impl.nio.TestDefaultNHttpServerConnection
Running org.apache.http.impl.nio.codecs.TestIdentityDecoder
Tests run: 8, Failures: 0, Errors: 0, Skipped: 0, Time elapsed: 0.006 sec - in org.apache.http.impl.nio.codecs.TestIdentityDecoder
Running org.apache.http.impl.nio.codecs.TestChunkEncoder
Tests run: 8, Failures: 0, Errors: 0, Skipped: 0, Time elapsed: 0.003 sec - in org.apache.http.impl.nio.codecs.TestChunkEncoder
Running org.apache.http.impl.nio.codecs.TestChunkDecoder
Tests run: 21, Failures: 0, Errors: 0, Skipped: 0, Time elapsed: 0.01 sec - in org.apache.http.impl.nio.codecs.TestChunkDecoder
Running org.apache.http.impl.nio.codecs.TestHttpMessageParser
Tests run: 17, Failures: 0, Errors: 0, Skipped: 0, Time elapsed: 0.007 sec - in org.apache.http.impl.nio.codecs.TestHttpMessageParser
Running org.apache.http.impl.nio.codecs.TestIdentityEncoder
Tests run: 20, Failures: 0, Errors: 0, Skipped: 0, Time elapsed: 0.127 sec - in org.apache.http.impl.nio.codecs.TestIdentityEncoder
Running org.apache.http.impl.nio.codecs.TestLengthDelimitedDecoder
Tests run: 15, Failures: 0, Errors: 0, Skipped: 0, Time elapsed: 0.007 sec - in org.apache.http.impl.nio.codecs.TestLengthDelimitedDecoder
Running org.apache.http.impl.nio.codecs.TestLengthDelimitedEncoder
Tests run: 23, Failures: 0, Errors: 0, Skipped: 0, Time elapsed: 0.094 sec - in org.apache.http.impl.nio.codecs.TestLengthDelimitedEncoder
Running org.apache.http.impl.nio.pool.TestBasicNIOConnPool
Tests run: 4, Failures: 0, Errors: 0, Skipped: 0, Time elapsed: 5.069 sec - in org.apache.http.impl.nio.pool.TestBasicNIOConnPool
Running org.apache.http.impl.nio.TestNHttpConnectionBase
Tests run: 14, Failures: 0, Errors: 0, Skipped: 0, Time elapsed: 0.026 sec - in org.apache.http.impl.nio.TestNHttpConnectionBase
Running org.apache.http.impl.nio.TestContentChannel
Tests run: 2, Failures: 0, Errors: 0, Skipped: 0, Time elapsed: 0.024 sec - in org.apache.http.impl.nio.TestContentChannel
Running org.apache.http.impl.nio.reactor.ExceptionEventTest
Tests run: 3, Failures: 0, Errors: 0, Skipped: 0, Time elapsed: 0.002 sec - in org.apache.http.impl.nio.reactor.ExceptionEventTest
Running org.apache.http.impl.nio.reactor.TestSessionInOutBuffers
Tests run: 42, Failures: 0, Errors: 0, Skipped: 0, Time elapsed: 0.04 sec - in org.apache.http.impl.nio.reactor.TestSessionInOutBuffers
Running org.apache.http.impl.nio.reactor.TestDefaultListeningIOReactor
Tests run: 3, Failures: 0, Errors: 0, Skipped: 0, Time elapsed: 0.509 sec - in org.apache.http.impl.nio.reactor.TestDefaultListeningIOReactor
Running org.apache.http.impl.nio.TestDefaultNHttpClientConnection
Tests run: 17, Failures: 0, Errors: 0, Skipped: 0, Time elapsed: 0.056 sec - in org.apache.http.impl.nio.TestDefaultNHttpClientConnection

Results :

Tests run: 457, Failures: 0, Errors: 0, Skipped: 0

[JENKINS] Recording test results
[INFO] 
[INFO] --- maven-jar-plugin:2.4:jar (default-jar) @ httpcore-nio ---
[INFO] Building jar: <https://builds.apache.org/job/httpcomponents-core-4.4.x/ws/httpcore-4.4.x/httpcore-nio/target/httpcore-nio-4.4.7-SNAPSHOT.jar>
[INFO] 
[INFO] --- maven-checkstyle-plugin:2.9.1:checkstyle (validate) @ httpcore-nio ---
[INFO] Starting audit...
Audit done.

[INFO] 
[INFO] --- maven-checkstyle-plugin:2.9.1:checkstyle (validate-main) @ httpcore-nio ---
[INFO] Starting audit...
Audit done.

[INFO] 
[INFO] --- maven-checkstyle-plugin:2.9.1:checkstyle (validate-test) @ httpcore-nio ---
[INFO] Starting audit...
Audit done.

[INFO] 
[INFO] --- maven-checkstyle-plugin:2.9.1:checkstyle (validate-examples) @ httpcore-nio ---
[INFO] Starting audit...
Audit done.

[INFO] 
[INFO] --- build-helper-maven-plugin:1.8:add-source (add-source) @ httpcore-nio ---
[INFO] Source directory: <https://builds.apache.org/job/httpcomponents-core-4.4.x/ws/httpcore-4.4.x/httpcore-nio/src/main/java-deprecated>
added.
[WARNING] Failed to getClass for org.apache.maven.plugin.source.SourceJarMojo
[INFO] 
[INFO] --- maven-source-plugin:2.2.1:jar (attach-sources) @ httpcore-nio ---
[INFO] Building jar: <https://builds.apache.org/job/httpcomponents-core-4.4.x/ws/httpcore-4.4.x/httpcore-nio/target/httpcore-nio-4.4.7-SNAPSHOT-sources.jar>
[INFO] 
[INFO] --- maven-javadoc-plugin:2.9.1:jar (attach-javadocs) @ httpcore-nio ---
[INFO] 
1 warning
[WARNING] Javadoc Warnings
[WARNING] warning: [options] bootstrap class path not set in conjunction with -source 1.6
[INFO] Building jar: <https://builds.apache.org/job/httpcomponents-core-4.4.x/ws/httpcore-4.4.x/httpcore-nio/target/httpcore-nio-4.4.7-SNAPSHOT-javadoc.jar>
[INFO] 
[INFO] --- maven-site-plugin:3.3:attach-descriptor (attach-descriptor) @ httpcore-nio ---
[INFO] 
[INFO] --- apache-rat-plugin:0.12:check (default) @ httpcore-nio ---
[INFO] Enabled default license matchers.
[INFO] Will parse SCM ignores for exclusions...
[INFO] Finished adding exclusions from SCM ignore files.
[INFO] 61 implicit excludes (use -debug for more details).
[INFO] Exclude: **/.externalToolBuilders/**
[INFO] Exclude: **/.pmd
[INFO] Exclude: **/maven-eclipse.xml
[INFO] Exclude: **/.checkstyle
[INFO] Exclude: src/docbkx/resources/**
[INFO] Exclude: src/test/resources/*.truststore
[INFO] 275 resources included (use -debug for more details)
[INFO] Rat check: Summary over all files. Unapproved: 0, unknown: 0, generated: 0, approved:
274 licenses.
[INFO] 
[INFO] --- maven-install-plugin:2.4:install (default-install) @ httpcore-nio ---
[INFO] Installing <https://builds.apache.org/job/httpcomponents-core-4.4.x/ws/httpcore-4.4.x/httpcore-nio/target/httpcore-nio-4.4.7-SNAPSHOT.jar>
to /home/jenkins/jenkins-slave/maven-repositories/1/org/apache/httpcomponents/httpcore-nio/4.4.7-SNAPSHOT/httpcore-nio-4.4.7-SNAPSHOT.jar
[INFO] Installing <https://builds.apache.org/job/httpcomponents-core-4.4.x/ws/httpcore-4.4.x/httpcore-nio/pom.xml>
to /home/jenkins/jenkins-slave/maven-repositories/1/org/apache/httpcomponents/httpcore-nio/4.4.7-SNAPSHOT/httpcore-nio-4.4.7-SNAPSHOT.pom
[INFO] Installing <https://builds.apache.org/job/httpcomponents-core-4.4.x/ws/httpcore-4.4.x/httpcore-nio/target/httpcore-nio-4.4.7-SNAPSHOT-sources.jar>
to /home/jenkins/jenkins-slave/maven-repositories/1/org/apache/httpcomponents/httpcore-nio/4.4.7-SNAPSHOT/httpcore-nio-4.4.7-SNAPSHOT-sources.jar
[INFO] Installing <https://builds.apache.org/job/httpcomponents-core-4.4.x/ws/httpcore-4.4.x/httpcore-nio/target/httpcore-nio-4.4.7-SNAPSHOT-javadoc.jar>
to /home/jenkins/jenkins-slave/maven-repositories/1/org/apache/httpcomponents/httpcore-nio/4.4.7-SNAPSHOT/httpcore-nio-4.4.7-SNAPSHOT-javadoc.jar
[INFO] 
[INFO] --- maven-checkstyle-plugin:2.9.1:checkstyle (validate) @ httpcore-nio ---
[INFO] Starting audit...
Audit done.

[INFO] 
[INFO] --- maven-checkstyle-plugin:2.9.1:checkstyle (validate-main) @ httpcore-nio ---
[INFO] Starting audit...
Audit done.

[INFO] 
[INFO] --- maven-checkstyle-plugin:2.9.1:checkstyle (validate-test) @ httpcore-nio ---
[INFO] Starting audit...
Audit done.

[INFO] 
[INFO] --- maven-checkstyle-plugin:2.9.1:checkstyle (validate-examples) @ httpcore-nio ---
[INFO] Starting audit...
Audit done.

[INFO] 
[INFO] --- build-helper-maven-plugin:1.8:add-source (add-source) @ httpcore-nio ---
[INFO] Source directory: <https://builds.apache.org/job/httpcomponents-core-4.4.x/ws/httpcore-4.4.x/httpcore-nio/src/main/java-deprecated>
added.
[INFO] 
[INFO] --- maven-remote-resources-plugin:1.4:process (default) @ httpcore-nio ---
[INFO] 
[INFO] --- buildnumber-maven-plugin:1.2:create (default) @ httpcore-nio ---
[INFO] Checking for local modifications: skipped.
[INFO] Updating project files from SCM: skipped.
[INFO] Executing: /bin/sh -c cd <https://builds.apache.org/job/httpcomponents-core-4.4.x/ws/httpcore-4.4.x/httpcore-nio>
&& svn --non-interactive info
[INFO] Working directory: <https://builds.apache.org/job/httpcomponents-core-4.4.x/ws/httpcore-4.4.x/httpcore-nio>
[INFO] Storing buildNumber: 1793919 at timestamp: 1493942519951
[INFO] Executing: /bin/sh -c cd <https://builds.apache.org/job/httpcomponents-core-4.4.x/ws/httpcore-4.4.x/httpcore-nio>
&& svn --non-interactive info
[INFO] Working directory: <https://builds.apache.org/job/httpcomponents-core-4.4.x/ws/httpcore-4.4.x/httpcore-nio>
[INFO] Storing buildScmBranch: branches/4.4.x/httpcore-nio
[INFO] 
[INFO] --- maven-resources-plugin:2.6:resources (default-resources) @ httpcore-nio ---
[INFO] Using 'UTF-8' encoding to copy filtered resources.
[INFO] Copying 1 resource
[INFO] Copying 3 resources
[INFO] Copying 3 resources
[INFO] 
[INFO] --- maven-compiler-plugin:3.1:compile (default-compile) @ httpcore-nio ---
[INFO] Changes detected - recompiling the module!
[INFO] Compiling 211 source files to <https://builds.apache.org/job/httpcomponents-core-4.4.x/ws/httpcore-4.4.x/httpcore-nio/target/classes>
[WARNING] <https://builds.apache.org/job/httpcomponents-core-4.4.x/ws/httpcore-4.4.x/httpcore-nio/src/main/java/org/apache/http/impl/nio/NHttpConnectionBase.java>:
Some input files use or override a deprecated API.
[WARNING] <https://builds.apache.org/job/httpcomponents-core-4.4.x/ws/httpcore-4.4.x/httpcore-nio/src/main/java/org/apache/http/impl/nio/NHttpConnectionBase.java>:
Recompile with -Xlint:deprecation for details.
[WARNING] Failed to getClass for org.codehaus.mojo.clirr.ClirrCheckMojo
[INFO] 
[INFO] --- clirr-maven-plugin:2.5:check (default-cli) @ httpcore-nio ---
[INFO] Comparing to version: 4.4
[ERROR] org.apache.http.impl.nio.SSLClientIOEventDispatch: Removed field sslcontext
[ERROR] org.apache.http.impl.nio.SSLServerIOEventDispatch: Removed field sslcontext
[INFO] ------------------------------------------------------------------------
[INFO] Reactor Summary:
[INFO] 
[INFO] Apache HttpComponents Core ........................ SUCCESS [7.594s]
[INFO] Apache HttpCore ................................... SUCCESS [42.382s]
[INFO] Apache HttpCore NIO ............................... FAILURE [35.557s]
[INFO] Apache HttpCore OSGi bundle ....................... SKIPPED
[INFO] Apache HttpCore Benchmarking Tool ................. SKIPPED
[INFO] ------------------------------------------------------------------------
[INFO] BUILD FAILURE
[INFO] ------------------------------------------------------------------------
[INFO] Total time: 1:29.797s
[INFO] Finished at: Fri May 05 00:02:01 UTC 2017
[INFO] Final Memory: 50M/410M
[INFO] ------------------------------------------------------------------------
Waiting for Jenkins to finish collecting data[ERROR] Failed to execute goal org.codehaus.mojo:clirr-maven-plugin:2.5:check
(default-cli) on project httpcore-nio: There were 2 errors. -> [Help 1]
[ERROR] 
[ERROR] To see the full stack trace of the errors, re-run Maven with the -e switch.
[ERROR] Re-run Maven using the -X switch to enable full debug logging.
[ERROR] 
[ERROR] For more information about the errors and possible solutions, please read the following
articles:
[ERROR] [Help 1] http://cwiki.apache.org/confluence/display/MAVEN/MojoFailureException
[ERROR] 
[ERROR] After correcting the problems, you can resume the build with the command
[ERROR]   mvn <goals> -rf :httpcore-nio

[JENKINS] Archiving <https://builds.apache.org/job/httpcomponents-core-4.4.x/ws/httpcore-4.4.x/httpcore/pom.xml>
to org.apache.httpcomponents/httpcore/4.4.7-SNAPSHOT/httpcore-4.4.7-SNAPSHOT.pom
[JENKINS] Archiving <https://builds.apache.org/job/httpcomponents-core-4.4.x/ws/httpcore-4.4.x/httpcore/target/httpcore-4.4.7-SNAPSHOT.jar>
to org.apache.httpcomponents/httpcore/4.4.7-SNAPSHOT/httpcore-4.4.7-SNAPSHOT.jar
[JENKINS] Archiving <https://builds.apache.org/job/httpcomponents-core-4.4.x/ws/httpcore-4.4.x/httpcore/target/httpcore-4.4.7-SNAPSHOT-sources.jar>
to org.apache.httpcomponents/httpcore/4.4.7-SNAPSHOT/httpcore-4.4.7-SNAPSHOT-sources.jar
[JENKINS] Archiving <https://builds.apache.org/job/httpcomponents-core-4.4.x/ws/httpcore-4.4.x/httpcore/target/httpcore-4.4.7-SNAPSHOT-javadoc.jar>
to org.apache.httpcomponents/httpcore/4.4.7-SNAPSHOT/httpcore-4.4.7-SNAPSHOT-javadoc.jar
[JENKINS] Archiving <https://builds.apache.org/job/httpcomponents-core-4.4.x/ws/httpcore-4.4.x/httpcore/target/httpcore-4.4.7-SNAPSHOT-tests.jar>
to org.apache.httpcomponents/httpcore/4.4.7-SNAPSHOT/httpcore-4.4.7-SNAPSHOT-tests.jar
[JENKINS] Archiving <https://builds.apache.org/job/httpcomponents-core-4.4.x/ws/httpcore-4.4.x/httpcore-osgi/pom.xml>
to org.apache.httpcomponents/httpcore-osgi/4.4.7-SNAPSHOT/httpcore-osgi-4.4.7-SNAPSHOT.pom
[JENKINS] Archiving <https://builds.apache.org/job/httpcomponents-core-4.4.x/ws/httpcore-4.4.x/httpcore-ab/pom.xml>
to org.apache.httpcomponents/httpcore-ab/4.4.7-SNAPSHOT/httpcore-ab-4.4.7-SNAPSHOT.pom
[JENKINS] Archiving <https://builds.apache.org/job/httpcomponents-core-4.4.x/ws/httpcore-4.4.x/pom.xml>
to org.apache.httpcomponents/httpcomponents-core/4.4.7-SNAPSHOT/httpcomponents-core-4.4.7-SNAPSHOT.pom
[JENKINS] Archiving <https://builds.apache.org/job/httpcomponents-core-4.4.x/ws/httpcore-4.4.x/httpcore-nio/pom.xml>
to org.apache.httpcomponents/httpcore-nio/4.4.7-SNAPSHOT/httpcore-nio-4.4.7-SNAPSHOT.pom
[JENKINS] Archiving <https://builds.apache.org/job/httpcomponents-core-4.4.x/ws/httpcore-4.4.x/httpcore-nio/target/httpcore-nio-4.4.7-SNAPSHOT.jar>
to org.apache.httpcomponents/httpcore-nio/4.4.7-SNAPSHOT/httpcore-nio-4.4.7-SNAPSHOT.jar
[JENKINS] Archiving <https://builds.apache.org/job/httpcomponents-core-4.4.x/ws/httpcore-4.4.x/httpcore-nio/target/httpcore-nio-4.4.7-SNAPSHOT-sources.jar>
to org.apache.httpcomponents/httpcore-nio/4.4.7-SNAPSHOT/httpcore-nio-4.4.7-SNAPSHOT-sources.jar
[JENKINS] Archiving <https://builds.apache.org/job/httpcomponents-core-4.4.x/ws/httpcore-4.4.x/httpcore-nio/target/httpcore-nio-4.4.7-SNAPSHOT-javadoc.jar>
to org.apache.httpcomponents/httpcore-nio/4.4.7-SNAPSHOT/httpcore-nio-4.4.7-SNAPSHOT-javadoc.jar
channel stopped

Mime
View raw message