hc-commits mailing list archives

Site index · List index
Message view « Date » · « Thread »
Top « Date » · « Thread »
From Apache Jenkins Server <jenk...@builds.apache.org>
Subject Build failed in Jenkins: httpcomponents-core-5.x #140
Date Fri, 02 Dec 2016 13:28:12 GMT
See <https://builds.apache.org/job/httpcomponents-core-5.x/140/changes>

Changes:

[ggregory] Add README.md for GitHub.

------------------------------------------
Started by an SCM change
[EnvInject] - Loading node environment variables.
Building remotely on H17 (ubuntu) in workspace <https://builds.apache.org/job/httpcomponents-core-5.x/ws/>
Updating http://svn.apache.org/repos/asf/httpcomponents/httpcore/trunk at revision '2016-12-02T13:02:22.937
+0000'
AU        httpcore5/src/test/java/org/apache/hc/core5/http/io/TestEofSensorInputStream.java
AU        httpcore5/src/main/java/org/apache/hc/core5/http/io/EofSensorInputStream.java
AU        httpcore5/src/main/java/org/apache/hc/core5/http/io/EofSensorWatcher.java
U         httpcore5/src/main/java/org/apache/hc/core5/http/message/LazyLineParser.java
U         pom.xml
A         README.md
At revision 1772343

Parsing POMs
Downloaded artifact http://repo.maven.apache.org/maven2/org/apache/httpcomponents/project/8/project-8.pom
Modules changed, recalculating dependency graph
Established TCP socket on 36917
maven32-agent.jar already up to date
maven32-interceptor.jar already up to date
maven3-interceptor-commons.jar already up to date
[httpcore-5.0.x] $ /home/jenkins/tools/java/latest1.7/bin/java -Xmx2g -Xms256m -XX:MaxPermSize=512m
-cp /home/jenkins/jenkins-slave/maven32-agent.jar:/home/jenkins/tools/maven/apache-maven-3.2.1/boot/plexus-classworlds-2.5.1.jar:/home/jenkins/tools/maven/apache-maven-3.2.1/conf/logging
jenkins.maven3.agent.Maven32Main /home/jenkins/tools/maven/apache-maven-3.2.1 /home/jenkins/jenkins-slave/slave.jar
/home/jenkins/jenkins-slave/maven32-interceptor.jar /home/jenkins/jenkins-slave/maven3-interceptor-commons.jar
36917
<===[JENKINS REMOTING CAPACITY]===>   channel started
Executing Maven:  -B -f <https://builds.apache.org/job/httpcomponents-core-5.x/ws/httpcore-5.0.x/pom.xml>
-Dmaven.repo.local=/home/jenkins/jenkins-slave/maven-repositories/0 clean install -DdisableOSGiTests=true
[INFO] Scanning for projects...
[INFO] ------------------------------------------------------------------------
[INFO] Reactor Build Order:
[INFO] 
[INFO] Apache HttpComponents Core Parent
[INFO] Apache HttpComponents Core HTTP/1.1
[INFO] Apache HttpComponents Core HTTP/2
[INFO] Apache HttpComponents Core Benchmarking Tool
[INFO] Apache HttpComponents Core Integration Tests
[INFO] Apache HttpComponents Core OSGi Bundle
[INFO] 
[INFO] Using the builder org.apache.maven.lifecycle.internal.builder.singlethreaded.SingleThreadedBuilder
with a thread count of 1
[INFO]                                                                         
[INFO] ------------------------------------------------------------------------
[INFO] Building Apache HttpComponents Core Parent 5.0-alpha2-SNAPSHOT
[INFO] ------------------------------------------------------------------------
[INFO] 
[INFO] --- maven-clean-plugin:3.0.0:clean (default-clean) @ httpcore5-parent ---
[INFO] Deleting <https://builds.apache.org/job/httpcomponents-core-5.x/ws/httpcore-5.0.x/target>
[INFO] 
[INFO] --- maven-checkstyle-plugin:2.9.1:checkstyle (validate) @ httpcore5-parent ---
[INFO] 
[INFO] --- maven-checkstyle-plugin:2.9.1:checkstyle (validate-main) @ httpcore5-parent ---
[INFO] 
[INFO] --- maven-checkstyle-plugin:2.9.1:checkstyle (validate-test) @ httpcore5-parent ---
[INFO] 
[INFO] --- maven-checkstyle-plugin:2.9.1:checkstyle (validate-examples) @ httpcore5-parent
---
[INFO] 
[INFO] --- build-helper-maven-plugin:1.12:parse-version (parse-version) @ httpcore5-parent
---
[INFO] 
[INFO] --- maven-remote-resources-plugin:1.5:process (process-resource-bundles) @ httpcore5-parent
---
[INFO] 
[INFO] --- buildnumber-maven-plugin:1.4:create (default) @ httpcore5-parent ---
[INFO] Executing: /bin/sh -c cd '<https://builds.apache.org/job/httpcomponents-core-5.x/ws/httpcore-5.0.x'>
&& 'svn' '--non-interactive' 'info'
[INFO] Working directory: <https://builds.apache.org/job/httpcomponents-core-5.x/ws/httpcore-5.0.x>
[INFO] Storing buildNumber: 1772343 at timestamp: 1480685172738
[INFO] Executing: /bin/sh -c cd '<https://builds.apache.org/job/httpcomponents-core-5.x/ws/httpcore-5.0.x'>
&& 'svn' '--non-interactive' 'info'
[INFO] Working directory: <https://builds.apache.org/job/httpcomponents-core-5.x/ws/httpcore-5.0.x>
[INFO] Storing buildScmBranch: trunk
[INFO] 
[INFO] --- animal-sniffer-maven-plugin:1.15:check (checkAPIcompatibility) @ httpcore5-parent
---
[INFO] Checking unresolved references to org.codehaus.mojo.signature:java17:1.0
[INFO] 
[INFO] >>> maven-source-plugin:3.0.1:jar (attach-sources) @ httpcore5-parent >>>
[INFO] 
[INFO] --- maven-checkstyle-plugin:2.9.1:checkstyle (validate) @ httpcore5-parent ---
[INFO] 
[INFO] --- maven-checkstyle-plugin:2.9.1:checkstyle (validate-main) @ httpcore5-parent ---
[INFO] 
[INFO] --- maven-checkstyle-plugin:2.9.1:checkstyle (validate-test) @ httpcore5-parent ---
[INFO] 
[INFO] --- maven-checkstyle-plugin:2.9.1:checkstyle (validate-examples) @ httpcore5-parent
---
[INFO] 
[INFO] --- build-helper-maven-plugin:1.12:parse-version (parse-version) @ httpcore5-parent
---
[WARNING] Failed to getClass for org.apache.maven.plugins.source.SourceJarMojo
[INFO] 
[INFO] <<< maven-source-plugin:3.0.1:jar (attach-sources) @ httpcore5-parent <<<
[INFO] 
[INFO] --- maven-source-plugin:3.0.1:jar (attach-sources) @ httpcore5-parent ---
[INFO] 
[INFO] --- maven-javadoc-plugin:2.10.4:jar (attach-javadocs) @ httpcore5-parent ---
[INFO] Not executing Javadoc as the project is not a Java classpath-capable package
[INFO] 
[INFO] --- maven-site-plugin:3.6:attach-descriptor (attach-descriptor) @ httpcore5-parent
---
[INFO] No site descriptor found: nothing to attach.
[INFO] 
[INFO] --- apache-rat-plugin:0.12:check (default) @ httpcore5-parent ---
[INFO] Enabled default license matchers.
[INFO] Will parse SCM ignores for exclusions...
[INFO] Parsing exclusions from <https://builds.apache.org/job/httpcomponents-core-5.x/ws/httpcore-5.0.x/.gitignore>
[INFO] Finished adding exclusions from SCM ignore files.
[INFO] 73 implicit excludes (use -debug for more details).
[INFO] Exclude: DEPENDENCIES
[INFO] Exclude: .pmd
[INFO] Exclude: **/.checkstyle
[INFO] Exclude: **/.pmd
[INFO] Exclude: **/*.iml
[INFO] Exclude: **/.externalToolBuilders/**
[INFO] Exclude: maven-eclipse.xml
[INFO] Exclude: src/docbkx/resources/**
[INFO] Exclude: src/test/resources/*.truststore
[INFO] 15 resources included (use -debug for more details)
[INFO] Rat check: Summary over all files. Unapproved: 1, unknown: 1, generated: 0, approved:
9 licenses.
[INFO] ------------------------------------------------------------------------
[INFO] Reactor Summary:
[INFO] 
[INFO] Apache HttpComponents Core Parent ................. FAILURE [ 15.247 s]
[INFO] Apache HttpComponents Core HTTP/1.1 ............... SKIPPED
[INFO] Apache HttpComponents Core HTTP/2 ................. SKIPPED
[INFO] Apache HttpComponents Core Benchmarking Tool ...... SKIPPED
[INFO] Apache HttpComponents Core Integration Tests ...... SKIPPED
[INFO] Apache HttpComponents Core OSGi Bundle ............ SKIPPED
[INFO] ------------------------------------------------------------------------
[INFO] BUILD FAILURE
[INFO] ------------------------------------------------------------------------
[INFO] Total time: 28.407 s
[INFO] Finished at: 2016-12-02T13:26:30+00:00
[INFO] Final Memory: 32M/316M
[INFO] ------------------------------------------------------------------------
Waiting for Jenkins to finish collecting data
[ERROR] Failed to execute goal org.apache.rat:apache-rat-plugin:0.12:check (default) on project
httpcore5-parent: Too many files with unapproved license: 1 See RAT report in: <https://builds.apache.org/job/httpcomponents-core-5.x/ws/httpcore-5.0.x/target/rat.txt>
-> [Help 1]
[ERROR] 
[ERROR] To see the full stack trace of the errors, re-run Maven with the -e switch.
[ERROR] Re-run Maven using the -X switch to enable full debug logging.
[ERROR] 
[ERROR] For more information about the errors and possible solutions, please read the following
articles:
[ERROR] [Help 1] http://cwiki.apache.org/confluence/display/MAVEN/MojoFailureException
[JENKINS] Archiving <https://builds.apache.org/job/httpcomponents-core-5.x/ws/httpcore-5.0.x/httpcore5-h2/pom.xml>
to org.apache.httpcomponents.core5/httpcore5-h2/5.0-alpha2-SNAPSHOT/httpcore5-h2-5.0-alpha2-SNAPSHOT.pom
[JENKINS] Archiving <https://builds.apache.org/job/httpcomponents-core-5.x/ws/httpcore-5.0.x/pom.xml>
to org.apache.httpcomponents.core5/httpcore5-parent/5.0-alpha2-SNAPSHOT/httpcore5-parent-5.0-alpha2-SNAPSHOT.pom
[JENKINS] Archiving <https://builds.apache.org/job/httpcomponents-core-5.x/ws/httpcore-5.0.x/httpcore5-ab/pom.xml>
to org.apache.httpcomponents.core5/httpcore5-ab/5.0-alpha2-SNAPSHOT/httpcore5-ab-5.0-alpha2-SNAPSHOT.pom
[JENKINS] Archiving <https://builds.apache.org/job/httpcomponents-core-5.x/ws/httpcore-5.0.x/httpcore5/pom.xml>
to org.apache.httpcomponents.core5/httpcore5/5.0-alpha2-SNAPSHOT/httpcore5-5.0-alpha2-SNAPSHOT.pom
[JENKINS] Archiving <https://builds.apache.org/job/httpcomponents-core-5.x/ws/httpcore-5.0.x/httpcore5-osgi/pom.xml>
to org.apache.httpcomponents.core5/httpcore5-osgi/5.0-alpha2-SNAPSHOT/httpcore5-osgi-5.0-alpha2-SNAPSHOT.pom
[JENKINS] Archiving <https://builds.apache.org/job/httpcomponents-core-5.x/ws/httpcore-5.0.x/httpcore5-testing/pom.xml>
to org.apache.httpcomponents.core5/httpcore5-testing/5.0-alpha2-SNAPSHOT/httpcore5-testing-5.0-alpha2-SNAPSHOT.pom
Sending e-mails to: commits@hc.apache.org
channel stopped

Mime
View raw message