hc-commits mailing list archives

Site index · List index
Message view « Date » · « Thread »
Top « Date » · « Thread »
From Apache Jenkins Server <jenk...@builds.apache.org>
Subject Build failed in Jenkins: httpcomponents-core-4.4.x #126
Date Wed, 08 Jun 2016 00:01:47 GMT
See <https://builds.apache.org/job/httpcomponents-core-4.4.x/126/changes>

Changes:

[olegk] HTTPCLIENT-1743: remove dependency on CC-BY licensed source

------------------------------------------
[...truncated 1076 lines...]
Running org.apache.http.protocol.TestHttpService
Tests run: 14, Failures: 0, Errors: 0, Skipped: 0, Time elapsed: 0.131 sec - in org.apache.http.protocol.TestHttpService
Running org.apache.http.protocol.TestHttpRequestExecutor
Tests run: 12, Failures: 0, Errors: 0, Skipped: 0, Time elapsed: 0.054 sec - in org.apache.http.protocol.TestHttpRequestExecutor
Running org.apache.http.config.TestRegistry
Tests run: 1, Failures: 0, Errors: 0, Skipped: 0, Time elapsed: 0 sec - in org.apache.http.config.TestRegistry
Running org.apache.http.impl.TestNoConnectionReuseStrategy
Tests run: 1, Failures: 0, Errors: 0, Skipped: 0, Time elapsed: 0.021 sec - in org.apache.http.impl.TestNoConnectionReuseStrategy
Running org.apache.http.impl.io.TestIdentityOutputStream
Tests run: 6, Failures: 0, Errors: 0, Skipped: 0, Time elapsed: 0.002 sec - in org.apache.http.impl.io.TestIdentityOutputStream
Running org.apache.http.impl.io.TestIdentityInputStream
Tests run: 4, Failures: 0, Errors: 0, Skipped: 0, Time elapsed: 0.003 sec - in org.apache.http.impl.io.TestIdentityInputStream
Running org.apache.http.impl.io.TestMessageParser
Tests run: 8, Failures: 0, Errors: 0, Skipped: 0, Time elapsed: 0.004 sec - in org.apache.http.impl.io.TestMessageParser
Running org.apache.http.impl.io.TestContentLengthInputStream
Tests run: 6, Failures: 0, Errors: 0, Skipped: 0, Time elapsed: 0.001 sec - in org.apache.http.impl.io.TestContentLengthInputStream
Running org.apache.http.impl.io.TestContentLengthOutputStream
Tests run: 3, Failures: 0, Errors: 0, Skipped: 0, Time elapsed: 0.001 sec - in org.apache.http.impl.io.TestContentLengthOutputStream
Running org.apache.http.impl.io.TestResponseParser
Tests run: 4, Failures: 0, Errors: 0, Skipped: 0, Time elapsed: 0.004 sec - in org.apache.http.impl.io.TestResponseParser
Running org.apache.http.impl.io.TestRequestParser
Tests run: 4, Failures: 0, Errors: 0, Skipped: 0, Time elapsed: 0.006 sec - in org.apache.http.impl.io.TestRequestParser
Running org.apache.http.impl.io.TestChunkCoding
Tests run: 25, Failures: 0, Errors: 0, Skipped: 0, Time elapsed: 0.013 sec - in org.apache.http.impl.io.TestChunkCoding
Running org.apache.http.impl.io.TestSessionInOutBuffers
Tests run: 21, Failures: 0, Errors: 0, Skipped: 0, Time elapsed: 0.111 sec - in org.apache.http.impl.io.TestSessionInOutBuffers
Running org.apache.http.impl.TestBasicRequest
Tests run: 2, Failures: 0, Errors: 0, Skipped: 0, Time elapsed: 0 sec - in org.apache.http.impl.TestBasicRequest
Running org.apache.http.impl.TestDefaultBHttpServerConnection
Tests run: 6, Failures: 0, Errors: 0, Skipped: 0, Time elapsed: 0.039 sec - in org.apache.http.impl.TestDefaultBHttpServerConnection
Running org.apache.http.impl.pool.TestBasicConnPool
Tests run: 4, Failures: 0, Errors: 0, Skipped: 0, Time elapsed: 0.013 sec - in org.apache.http.impl.pool.TestBasicConnPool
Running org.apache.http.impl.TestBHttpConnectionBase
Tests run: 22, Failures: 0, Errors: 0, Skipped: 0, Time elapsed: 0.059 sec - in org.apache.http.impl.TestBHttpConnectionBase
Running org.apache.http.impl.TestDefaultBHttpClientConnection
Tests run: 5, Failures: 0, Errors: 0, Skipped: 0, Time elapsed: 0.003 sec - in org.apache.http.impl.TestDefaultBHttpClientConnection
Running org.apache.http.impl.entity.TestDisallowIdentityContentLengthStrategy
Tests run: 2, Failures: 0, Errors: 0, Skipped: 0, Time elapsed: 0.006 sec - in org.apache.http.impl.entity.TestDisallowIdentityContentLengthStrategy
Running org.apache.http.impl.entity.TestLaxContentLengthStrategy
Tests run: 10, Failures: 0, Errors: 0, Skipped: 0, Time elapsed: 0.003 sec - in org.apache.http.impl.entity.TestLaxContentLengthStrategy
Running org.apache.http.impl.entity.TestStrictContentLengthStrategy
Tests run: 8, Failures: 0, Errors: 0, Skipped: 0, Time elapsed: 0.003 sec - in org.apache.http.impl.entity.TestStrictContentLengthStrategy
Running org.apache.http.impl.TestEnglishReasonPhraseCatalog
Tests run: 3, Failures: 0, Errors: 0, Skipped: 0, Time elapsed: 0.003 sec - in org.apache.http.impl.TestEnglishReasonPhraseCatalog
Running org.apache.http.impl.TestDefaultConnectionReuseStrategy
Tests run: 25, Failures: 0, Errors: 0, Skipped: 0, Time elapsed: 0.008 sec - in org.apache.http.impl.TestDefaultConnectionReuseStrategy
Running org.apache.http.entity.TestEntityTemplate
Tests run: 4, Failures: 0, Errors: 0, Skipped: 0, Time elapsed: 0.001 sec - in org.apache.http.entity.TestEntityTemplate
Running org.apache.http.entity.TestBasicHttpEntity
Tests run: 3, Failures: 0, Errors: 0, Skipped: 0, Time elapsed: 0 sec - in org.apache.http.entity.TestBasicHttpEntity
Running org.apache.http.entity.TestAbstractHttpEntity
Tests run: 3, Failures: 0, Errors: 0, Skipped: 0, Time elapsed: 0 sec - in org.apache.http.entity.TestAbstractHttpEntity
Running org.apache.http.entity.TestFileEntity
Tests run: 3, Failures: 0, Errors: 0, Skipped: 0, Time elapsed: 0.02 sec - in org.apache.http.entity.TestFileEntity
Running org.apache.http.entity.TestHttpEntityWrapper
Tests run: 4, Failures: 0, Errors: 0, Skipped: 0, Time elapsed: 0.001 sec - in org.apache.http.entity.TestHttpEntityWrapper
Running org.apache.http.entity.TestByteArrayEntity
Tests run: 8, Failures: 0, Errors: 0, Skipped: 0, Time elapsed: 0.003 sec - in org.apache.http.entity.TestByteArrayEntity
Running org.apache.http.entity.TestBufferedHttpEntity
Tests run: 5, Failures: 0, Errors: 0, Skipped: 0, Time elapsed: 0 sec - in org.apache.http.entity.TestBufferedHttpEntity
Running org.apache.http.entity.TestStringEntity
Tests run: 5, Failures: 0, Errors: 0, Skipped: 0, Time elapsed: 0 sec - in org.apache.http.entity.TestStringEntity
Running org.apache.http.entity.TestSerializableEntity
Tests run: 5, Failures: 0, Errors: 0, Skipped: 0, Time elapsed: 0.003 sec - in org.apache.http.entity.TestSerializableEntity
Running org.apache.http.entity.TestInputStreamEntity
Tests run: 7, Failures: 0, Errors: 0, Skipped: 0, Time elapsed: 0.002 sec - in org.apache.http.entity.TestInputStreamEntity
Running org.apache.http.entity.TestContentType
Tests run: 18, Failures: 0, Errors: 0, Skipped: 0, Time elapsed: 0.047 sec - in org.apache.http.entity.TestContentType
Running org.apache.http.integration.TestSyncHttp
Tests run: 11, Failures: 0, Errors: 0, Skipped: 0, Time elapsed: 2.788 sec - in org.apache.http.integration.TestSyncHttp
Running org.apache.http.concurrent.TestBasicFuture
Tests run: 9, Failures: 0, Errors: 0, Skipped: 0, Time elapsed: 0.309 sec - in org.apache.http.concurrent.TestBasicFuture
Running org.apache.http.TestHttpExceptions
Tests run: 1, Failures: 0, Errors: 0, Skipped: 0, Time elapsed: 0.001 sec - in org.apache.http.TestHttpExceptions
Running org.apache.http.util.TestArgs
Tests run: 25, Failures: 0, Errors: 0, Skipped: 0, Time elapsed: 0.008 sec - in org.apache.http.util.TestArgs
Running org.apache.http.util.TestLangUtils
Tests run: 5, Failures: 0, Errors: 0, Skipped: 0, Time elapsed: 0 sec - in org.apache.http.util.TestLangUtils
Running org.apache.http.util.TestCharArrayBuffer
Tests run: 22, Failures: 0, Errors: 0, Skipped: 0, Time elapsed: 0.005 sec - in org.apache.http.util.TestCharArrayBuffer
Running org.apache.http.util.TestEntityUtils
Tests run: 14, Failures: 0, Errors: 0, Skipped: 0, Time elapsed: 0.029 sec - in org.apache.http.util.TestEntityUtils
Running org.apache.http.util.TestAsserts
Tests run: 8, Failures: 0, Errors: 0, Skipped: 0, Time elapsed: 0.002 sec - in org.apache.http.util.TestAsserts
Running org.apache.http.util.TestByteArrayBuffer
Tests run: 15, Failures: 0, Errors: 0, Skipped: 0, Time elapsed: 0.007 sec - in org.apache.http.util.TestByteArrayBuffer
Running org.apache.http.util.TestTextUtils
Tests run: 3, Failures: 0, Errors: 0, Skipped: 0, Time elapsed: 0.001 sec - in org.apache.http.util.TestTextUtils
Running org.apache.http.util.TestEncodingUtils
Tests run: 5, Failures: 0, Errors: 0, Skipped: 0, Time elapsed: 0.004 sec - in org.apache.http.util.TestEncodingUtils

Results :

Tests run: 645, Failures: 0, Errors: 0, Skipped: 0

[JENKINS] Recording test results
[INFO] 
[INFO] --- maven-jar-plugin:2.6:jar (default-jar) @ httpcore ---
[INFO] Building jar: <https://builds.apache.org/job/httpcomponents-core-4.4.x/ws/httpcore-4.4.x/httpcore/target/httpcore-4.4.5-SNAPSHOT.jar>
[INFO] 
[INFO] --- maven-checkstyle-plugin:2.9.1:checkstyle (validate) @ httpcore ---
[INFO] Starting audit...
Audit done.

[INFO] 
[INFO] --- maven-checkstyle-plugin:2.9.1:checkstyle (validate-main) @ httpcore ---
[INFO] Starting audit...
Audit done.

[INFO] 
[INFO] --- maven-checkstyle-plugin:2.9.1:checkstyle (validate-test) @ httpcore ---
[INFO] Starting audit...
Audit done.

[INFO] 
[INFO] --- maven-checkstyle-plugin:2.9.1:checkstyle (validate-examples) @ httpcore ---
[INFO] Starting audit...
Audit done.

[INFO] 
[INFO] --- build-helper-maven-plugin:1.8:add-source (add-source) @ httpcore ---
[INFO] Source directory: <https://builds.apache.org/job/httpcomponents-core-4.4.x/ws/httpcore-4.4.x/httpcore/src/main/java-deprecated>
added.
[WARNING] Failed to getClass for org.apache.maven.plugin.source.SourceJarMojo
[INFO] 
[INFO] --- maven-source-plugin:2.2.1:jar (attach-sources) @ httpcore ---
[INFO] Building jar: <https://builds.apache.org/job/httpcomponents-core-4.4.x/ws/httpcore-4.4.x/httpcore/target/httpcore-4.4.5-SNAPSHOT-sources.jar>
[INFO] 
[INFO] --- maven-javadoc-plugin:2.9.1:jar (attach-javadocs) @ httpcore ---
[INFO] 
1 warning
[WARNING] Javadoc Warnings
[WARNING] warning: [options] bootstrap class path not set in conjunction with -source 1.6
[INFO] Building jar: <https://builds.apache.org/job/httpcomponents-core-4.4.x/ws/httpcore-4.4.x/httpcore/target/httpcore-4.4.5-SNAPSHOT-javadoc.jar>
[INFO] 
[INFO] --- maven-site-plugin:3.3:attach-descriptor (attach-descriptor) @ httpcore ---
[INFO] 
[INFO] --- maven-jar-plugin:2.6:test-jar (default) @ httpcore ---
[INFO] Building jar: <https://builds.apache.org/job/httpcomponents-core-4.4.x/ws/httpcore-4.4.x/httpcore/target/httpcore-4.4.5-SNAPSHOT-tests.jar>
[INFO] 
[INFO] --- apache-rat-plugin:0.11:check (default) @ httpcore ---
[INFO] 51 implicit excludes (use -debug for more details).
[INFO] Exclude: .externalToolBuilders/**
[INFO] Exclude: .pmd
[INFO] Exclude: maven-eclipse.xml
[INFO] 360 resources included (use -debug for more details)
Warning:  org.apache.xerces.jaxp.SAXParserImpl$JAXPSAXParser: Property 'http://www.oracle.com/xml/jaxp/properties/entityExpansionLimit'
is not recognized.
Compiler warnings:
  WARNING:  'org.apache.xerces.jaxp.SAXParserImpl: Property 'http://javax.xml.XMLConstants/property/accessExternalDTD'
is not recognized.'
Warning:  org.apache.xerces.parsers.SAXParser: Feature 'http://javax.xml.XMLConstants/feature/secure-processing'
is not recognized.
Warning:  org.apache.xerces.parsers.SAXParser: Property 'http://javax.xml.XMLConstants/property/accessExternalDTD'
is not recognized.
Warning:  org.apache.xerces.parsers.SAXParser: Property 'http://www.oracle.com/xml/jaxp/properties/entityExpansionLimit'
is not recognized.
[INFO] Rat check: Summary of files. Unapproved: 0 unknown: 0 generated: 0 approved: 352 licence.
[INFO] 
[INFO] --- maven-install-plugin:2.4:install (default-install) @ httpcore ---
[INFO] Installing <https://builds.apache.org/job/httpcomponents-core-4.4.x/ws/httpcore-4.4.x/httpcore/target/httpcore-4.4.5-SNAPSHOT.jar>
to /home/jenkins/jenkins-slave/maven-repositories/1/org/apache/httpcomponents/httpcore/4.4.5-SNAPSHOT/httpcore-4.4.5-SNAPSHOT.jar
[INFO] Installing <https://builds.apache.org/job/httpcomponents-core-4.4.x/ws/httpcore-4.4.x/httpcore/pom.xml>
to /home/jenkins/jenkins-slave/maven-repositories/1/org/apache/httpcomponents/httpcore/4.4.5-SNAPSHOT/httpcore-4.4.5-SNAPSHOT.pom
[INFO] Installing <https://builds.apache.org/job/httpcomponents-core-4.4.x/ws/httpcore-4.4.x/httpcore/target/httpcore-4.4.5-SNAPSHOT-sources.jar>
to /home/jenkins/jenkins-slave/maven-repositories/1/org/apache/httpcomponents/httpcore/4.4.5-SNAPSHOT/httpcore-4.4.5-SNAPSHOT-sources.jar
[INFO] Installing <https://builds.apache.org/job/httpcomponents-core-4.4.x/ws/httpcore-4.4.x/httpcore/target/httpcore-4.4.5-SNAPSHOT-javadoc.jar>
to /home/jenkins/jenkins-slave/maven-repositories/1/org/apache/httpcomponents/httpcore/4.4.5-SNAPSHOT/httpcore-4.4.5-SNAPSHOT-javadoc.jar
[INFO] Installing <https://builds.apache.org/job/httpcomponents-core-4.4.x/ws/httpcore-4.4.x/httpcore/target/httpcore-4.4.5-SNAPSHOT-tests.jar>
to /home/jenkins/jenkins-slave/maven-repositories/1/org/apache/httpcomponents/httpcore/4.4.5-SNAPSHOT/httpcore-4.4.5-SNAPSHOT-tests.jar
[INFO] 
[INFO] --- maven-checkstyle-plugin:2.9.1:checkstyle (validate) @ httpcore ---
[INFO] Starting audit...
Audit done.

[INFO] 
[INFO] --- maven-checkstyle-plugin:2.9.1:checkstyle (validate-main) @ httpcore ---
[INFO] Starting audit...
Audit done.

[INFO] 
[INFO] --- maven-checkstyle-plugin:2.9.1:checkstyle (validate-test) @ httpcore ---
[INFO] Starting audit...
Audit done.

[INFO] 
[INFO] --- maven-checkstyle-plugin:2.9.1:checkstyle (validate-examples) @ httpcore ---
[INFO] Starting audit...
Audit done.

[INFO] 
[INFO] --- build-helper-maven-plugin:1.8:add-source (add-source) @ httpcore ---
[INFO] Source directory: <https://builds.apache.org/job/httpcomponents-core-4.4.x/ws/httpcore-4.4.x/httpcore/src/main/java-deprecated>
added.
[INFO] 
[INFO] --- maven-remote-resources-plugin:1.4:process (default) @ httpcore ---
[INFO] 
[INFO] --- buildnumber-maven-plugin:1.2:create (default) @ httpcore ---
[INFO] Checking for local modifications: skipped.
[INFO] Updating project files from SCM: skipped.
[INFO] Executing: /bin/sh -c cd <https://builds.apache.org/job/httpcomponents-core-4.4.x/ws/httpcore-4.4.x/httpcore>
&& svn --non-interactive info
[INFO] Working directory: <https://builds.apache.org/job/httpcomponents-core-4.4.x/ws/httpcore-4.4.x/httpcore>
[INFO] Storing buildNumber: 1747290 at timestamp: 1465344103469
[INFO] Executing: /bin/sh -c cd <https://builds.apache.org/job/httpcomponents-core-4.4.x/ws/httpcore-4.4.x/httpcore>
&& svn --non-interactive info
[INFO] Working directory: <https://builds.apache.org/job/httpcomponents-core-4.4.x/ws/httpcore-4.4.x/httpcore>
[INFO] Storing buildScmBranch: branches/4.4.x/httpcore
[INFO] 
[INFO] --- maven-resources-plugin:2.6:resources (default-resources) @ httpcore ---
[INFO] Using 'UTF-8' encoding to copy filtered resources.
[INFO] Copying 1 resource
[INFO] Copying 3 resources
[INFO] Copying 3 resources
[INFO] 
[INFO] --- maven-compiler-plugin:3.1:compile (default-compile) @ httpcore ---
[INFO] Changes detected - recompiling the module!
[INFO] Compiling 257 source files to <https://builds.apache.org/job/httpcomponents-core-4.4.x/ws/httpcore-4.4.x/httpcore/target/classes>
[WARNING] Failed to getClass for org.codehaus.mojo.clirr.ClirrCheckMojo
[INFO] 
[INFO] --- clirr-maven-plugin:2.5:check (default-cli) @ httpcore ---
[INFO] Comparing to version: 4.4
[ERROR] org.apache.http.annotation.GuardedBy: Class org.apache.http.annotation.GuardedBy removed
[ERROR] org.apache.http.annotation.Immutable: Class org.apache.http.annotation.Immutable removed
[ERROR] org.apache.http.annotation.NotThreadSafe: Class org.apache.http.annotation.NotThreadSafe
removed
[ERROR] org.apache.http.annotation.ThreadSafe: Class org.apache.http.annotation.ThreadSafe
removed
[INFO] ------------------------------------------------------------------------
[INFO] Reactor Summary:
[INFO] 
[INFO] Apache HttpComponents Core ........................ SUCCESS [9.912s]
[INFO] Apache HttpCore ................................... FAILURE [43.942s]
[INFO] Apache HttpCore NIO ............................... SKIPPED
[INFO] Apache HttpCore OSGi bundle ....................... SKIPPED
[INFO] Apache HttpCore Benchmarking Tool ................. SKIPPED
[INFO] ------------------------------------------------------------------------
[INFO] BUILD FAILURE
[INFO] ------------------------------------------------------------------------
[INFO] Total time: 58.572s
[INFO] Finished at: Wed Jun 08 00:01:46 UTC 2016
[INFO] Final Memory: 51M/810M
[INFO] ------------------------------------------------------------------------
Waiting for Jenkins to finish collecting data
[ERROR] Failed to execute goal org.codehaus.mojo:clirr-maven-plugin:2.5:check (default-cli)
on project httpcore: There were 4 errors. -> [Help 1]
[ERROR] 
[ERROR] To see the full stack trace of the errors, re-run Maven with the -e switch.
[ERROR] Re-run Maven using the -X switch to enable full debug logging.
[ERROR] 
[ERROR] For more information about the errors and possible solutions, please read the following
articles:
[ERROR] [Help 1] http://cwiki.apache.org/confluence/display/MAVEN/MojoFailureException
[ERROR] 
[ERROR] After correcting the problems, you can resume the build with the command
[ERROR]   mvn <goals> -rf :httpcore
[JENKINS] Archiving <https://builds.apache.org/job/httpcomponents-core-4.4.x/ws/httpcore-4.4.x/httpcore/pom.xml>
to org.apache.httpcomponents/httpcore/4.4.5-SNAPSHOT/httpcore-4.4.5-SNAPSHOT.pom
[JENKINS] Archiving <https://builds.apache.org/job/httpcomponents-core-4.4.x/ws/httpcore-4.4.x/httpcore/target/httpcore-4.4.5-SNAPSHOT.jar>
to org.apache.httpcomponents/httpcore/4.4.5-SNAPSHOT/httpcore-4.4.5-SNAPSHOT.jar
[JENKINS] Archiving <https://builds.apache.org/job/httpcomponents-core-4.4.x/ws/httpcore-4.4.x/httpcore/target/httpcore-4.4.5-SNAPSHOT-sources.jar>
to org.apache.httpcomponents/httpcore/4.4.5-SNAPSHOT/httpcore-4.4.5-SNAPSHOT-sources.jar
[JENKINS] Archiving <https://builds.apache.org/job/httpcomponents-core-4.4.x/ws/httpcore-4.4.x/httpcore/target/httpcore-4.4.5-SNAPSHOT-javadoc.jar>
to org.apache.httpcomponents/httpcore/4.4.5-SNAPSHOT/httpcore-4.4.5-SNAPSHOT-javadoc.jar
[JENKINS] Archiving <https://builds.apache.org/job/httpcomponents-core-4.4.x/ws/httpcore-4.4.x/httpcore/target/httpcore-4.4.5-SNAPSHOT-tests.jar>
to org.apache.httpcomponents/httpcore/4.4.5-SNAPSHOT/httpcore-4.4.5-SNAPSHOT-tests.jar
[JENKINS] Archiving <https://builds.apache.org/job/httpcomponents-core-4.4.x/ws/httpcore-4.4.x/httpcore-nio/pom.xml>
to org.apache.httpcomponents/httpcore-nio/4.4.5-SNAPSHOT/httpcore-nio-4.4.5-SNAPSHOT.pom
[JENKINS] Archiving <https://builds.apache.org/job/httpcomponents-core-4.4.x/ws/httpcore-4.4.x/pom.xml>
to org.apache.httpcomponents/httpcomponents-core/4.4.5-SNAPSHOT/httpcomponents-core-4.4.5-SNAPSHOT.pom
[JENKINS] Archiving <https://builds.apache.org/job/httpcomponents-core-4.4.x/ws/httpcore-4.4.x/httpcore-ab/pom.xml>
to org.apache.httpcomponents/httpcore-ab/4.4.5-SNAPSHOT/httpcore-ab-4.4.5-SNAPSHOT.pom
[JENKINS] Archiving <https://builds.apache.org/job/httpcomponents-core-4.4.x/ws/httpcore-4.4.x/httpcore-osgi/pom.xml>
to org.apache.httpcomponents/httpcore-osgi/4.4.5-SNAPSHOT/httpcore-osgi-4.4.5-SNAPSHOT.pom
Sending e-mails to: commits@hc.apache.org
channel stopped

Mime
View raw message