hc-commits mailing list archives

Site index · List index
Message view « Date » · « Thread »
Top « Date » · « Thread »
From Apache Jenkins Server <jenk...@builds.apache.org>
Subject Build failed in Jenkins: httpcomponents-core-5.x #94
Date Fri, 11 Mar 2016 21:24:13 GMT
See <https://builds.apache.org/job/httpcomponents-core-5.x/94/changes>

Changes:

[ggregory] Fix Checkstyle errors.

------------------------------------------
[...truncated 256 lines...]
Running org.apache.hc.core5.http.io.TestUriHttpRequestHandlerMapper
Tests run: 5, Failures: 0, Errors: 0, Skipped: 0, Time elapsed: 0.035 sec - in org.apache.hc.core5.http.io.TestUriHttpRequestHandlerMapper
Running org.apache.hc.core5.http.message.TestAbstractMessage
Tests run: 3, Failures: 0, Errors: 0, Skipped: 0, Time elapsed: 0.004 sec - in org.apache.hc.core5.http.message.TestAbstractMessage
Running org.apache.hc.core5.http.message.TestStatusLine
Tests run: 4, Failures: 0, Errors: 0, Skipped: 0, Time elapsed: 0.005 sec - in org.apache.hc.core5.http.message.TestStatusLine
Running org.apache.hc.core5.http.message.TestBufferedHeader
Tests run: 3, Failures: 0, Errors: 0, Skipped: 0, Time elapsed: 0.004 sec - in org.apache.hc.core5.http.message.TestBufferedHeader
Running org.apache.hc.core5.http.message.TestBasicLineFormatter
Tests run: 7, Failures: 0, Errors: 0, Skipped: 0, Time elapsed: 0.006 sec - in org.apache.hc.core5.http.message.TestBasicLineFormatter
Running org.apache.hc.core5.http.message.TestBasicHeaderIterator
Tests run: 5, Failures: 0, Errors: 0, Skipped: 0, Time elapsed: 0.004 sec - in org.apache.hc.core5.http.message.TestBasicHeaderIterator
Running org.apache.hc.core5.http.message.TestHeaderElement
Tests run: 5, Failures: 0, Errors: 0, Skipped: 0, Time elapsed: 0.003 sec - in org.apache.hc.core5.http.message.TestHeaderElement
Running org.apache.hc.core5.http.message.TestBasicHeaderElementIterator
Tests run: 3, Failures: 0, Errors: 0, Skipped: 0, Time elapsed: 0.002 sec - in org.apache.hc.core5.http.message.TestBasicHeaderElementIterator
Running org.apache.hc.core5.http.message.TestBasicMessages
Tests run: 5, Failures: 0, Errors: 0, Skipped: 0, Time elapsed: 0.002 sec - in org.apache.hc.core5.http.message.TestBasicMessages
Running org.apache.hc.core5.http.message.TestTokenParser
Tests run: 10, Failures: 0, Errors: 0, Skipped: 0, Time elapsed: 0.004 sec - in org.apache.hc.core5.http.message.TestTokenParser
Running org.apache.hc.core5.http.message.TestBasicHeaderValueParser
Tests run: 8, Failures: 0, Errors: 0, Skipped: 0, Time elapsed: 0.003 sec - in org.apache.hc.core5.http.message.TestBasicHeaderValueParser
Running org.apache.hc.core5.http.message.TestHeaderGroup
Tests run: 10, Failures: 0, Errors: 0, Skipped: 0, Time elapsed: 0.007 sec - in org.apache.hc.core5.http.message.TestHeaderGroup
Running org.apache.hc.core5.http.message.TestHeader
Tests run: 5, Failures: 0, Errors: 0, Skipped: 0, Time elapsed: 0.001 sec - in org.apache.hc.core5.http.message.TestHeader
Running org.apache.hc.core5.http.message.TestBasicLineParser
Tests run: 8, Failures: 0, Errors: 0, Skipped: 0, Time elapsed: 0.004 sec - in org.apache.hc.core5.http.message.TestBasicLineParser
Running org.apache.hc.core5.http.message.TestBasicHttpResponse
Tests run: 3, Failures: 0, Errors: 0, Skipped: 0, Time elapsed: 0 sec - in org.apache.hc.core5.http.message.TestBasicHttpResponse
Running org.apache.hc.core5.http.message.TestBasicHeaderValueFormatter
Tests run: 5, Failures: 0, Errors: 0, Skipped: 0, Time elapsed: 0.002 sec - in org.apache.hc.core5.http.message.TestBasicHeaderValueFormatter
Running org.apache.hc.core5.http.message.TestNameValuePair
Tests run: 3, Failures: 0, Errors: 0, Skipped: 0, Time elapsed: 0 sec - in org.apache.hc.core5.http.message.TestNameValuePair
Running org.apache.hc.core5.http.message.TestBasicTokenIterator
Tests run: 6, Failures: 0, Errors: 0, Skipped: 0, Time elapsed: 0.002 sec - in org.apache.hc.core5.http.message.TestBasicTokenIterator
Running org.apache.hc.core5.http.message.TestRequestLine
Tests run: 3, Failures: 0, Errors: 0, Skipped: 0, Time elapsed: 0.001 sec - in org.apache.hc.core5.http.message.TestRequestLine
Running org.apache.hc.core5.http.TestHttpExceptions
Tests run: 1, Failures: 0, Errors: 0, Skipped: 0, Time elapsed: 0 sec - in org.apache.hc.core5.http.TestHttpExceptions
Running org.apache.hc.core5.http.impl.TestDefaultContentLengthStrategy
Tests run: 7, Failures: 0, Errors: 0, Skipped: 0, Time elapsed: 0.002 sec - in org.apache.hc.core5.http.impl.TestDefaultContentLengthStrategy
Running org.apache.hc.core5.http.impl.TestDefaultConnectionReuseStrategy
Tests run: 24, Failures: 0, Errors: 0, Skipped: 0, Time elapsed: 0.012 sec - in org.apache.hc.core5.http.impl.TestDefaultConnectionReuseStrategy
Running org.apache.hc.core5.http.impl.TestBasicRequest
Tests run: 2, Failures: 0, Errors: 0, Skipped: 0, Time elapsed: 0 sec - in org.apache.hc.core5.http.impl.TestBasicRequest
Running org.apache.hc.core5.http.impl.nio.TestBasicAsyncResponseConsumer
Tests run: 6, Failures: 0, Errors: 0, Skipped: 0, Time elapsed: 0.07 sec - in org.apache.hc.core5.http.impl.nio.TestBasicAsyncResponseConsumer
Running org.apache.hc.core5.http.impl.nio.TestUriHttpAsyncRequestHandlerMapper
Tests run: 5, Failures: 0, Errors: 0, Skipped: 0, Time elapsed: 0.009 sec - in org.apache.hc.core5.http.impl.nio.TestUriHttpAsyncRequestHandlerMapper
Running org.apache.hc.core5.http.impl.nio.TestLengthDelimitedDecoder
Tests run: 15, Failures: 0, Errors: 0, Skipped: 0, Time elapsed: 0.01 sec - in org.apache.hc.core5.http.impl.nio.TestLengthDelimitedDecoder
Running org.apache.hc.core5.http.impl.nio.TestHttpMessageParser
Tests run: 20, Failures: 0, Errors: 0, Skipped: 0, Time elapsed: 0.01 sec - in org.apache.hc.core5.http.impl.nio.TestHttpMessageParser
Running org.apache.hc.core5.http.impl.nio.TestHttpAsyncService
Tests run: 47, Failures: 0, Errors: 0, Skipped: 0, Time elapsed: 0.234 sec - in org.apache.hc.core5.http.impl.nio.TestHttpAsyncService
Running org.apache.hc.core5.http.impl.nio.TestLengthDelimitedEncoder
Tests run: 23, Failures: 0, Errors: 0, Skipped: 0, Time elapsed: 0.136 sec - in org.apache.hc.core5.http.impl.nio.TestLengthDelimitedEncoder
Running org.apache.hc.core5.http.impl.nio.TestIdentityEncoder
Tests run: 20, Failures: 0, Errors: 0, Skipped: 0, Time elapsed: 0.1 sec - in org.apache.hc.core5.http.impl.nio.TestIdentityEncoder
Running org.apache.hc.core5.http.impl.nio.TestBasicAsyncRequestConsumer
Tests run: 3, Failures: 0, Errors: 0, Skipped: 0, Time elapsed: 0.026 sec - in org.apache.hc.core5.http.impl.nio.TestBasicAsyncRequestConsumer
Running org.apache.hc.core5.http.impl.nio.TestBasicAsyncRequestHandler
Tests run: 3, Failures: 0, Errors: 0, Skipped: 0, Time elapsed: 0.007 sec - in org.apache.hc.core5.http.impl.nio.TestBasicAsyncRequestHandler
Running org.apache.hc.core5.http.impl.nio.TestHttpAsyncRequestExecutor
Tests run: 46, Failures: 0, Errors: 0, Skipped: 0, Time elapsed: 0.095 sec - in org.apache.hc.core5.http.impl.nio.TestHttpAsyncRequestExecutor
Running org.apache.hc.core5.http.impl.nio.TestContentChannel
Tests run: 2, Failures: 0, Errors: 0, Skipped: 0, Time elapsed: 0.019 sec - in org.apache.hc.core5.http.impl.nio.TestContentChannel
Running org.apache.hc.core5.http.impl.nio.TestChunkDecoder
Tests run: 20, Failures: 0, Errors: 0, Skipped: 0, Time elapsed: 0.009 sec - in org.apache.hc.core5.http.impl.nio.TestChunkDecoder
Running org.apache.hc.core5.http.impl.nio.TestDefaultNHttpClientConnection
Tests run: 17, Failures: 0, Errors: 0, Skipped: 0, Time elapsed: 0.081 sec - in org.apache.hc.core5.http.impl.nio.TestDefaultNHttpClientConnection
Running org.apache.hc.core5.http.impl.nio.TestBasicAsyncResponseProducer
Tests run: 5, Failures: 0, Errors: 0, Skipped: 0, Time elapsed: 0.008 sec - in org.apache.hc.core5.http.impl.nio.TestBasicAsyncResponseProducer
Running org.apache.hc.core5.http.impl.nio.TestNHttpConnectionBase
Tests run: 10, Failures: 0, Errors: 0, Skipped: 0, Time elapsed: 0.014 sec - in org.apache.hc.core5.http.impl.nio.TestNHttpConnectionBase
Running org.apache.hc.core5.http.impl.nio.TestSessionInOutBuffers
Tests run: 42, Failures: 0, Errors: 0, Skipped: 0, Time elapsed: 0.018 sec - in org.apache.hc.core5.http.impl.nio.TestSessionInOutBuffers
Running org.apache.hc.core5.http.impl.nio.TestErrorResponseProducer
Tests run: 2, Failures: 0, Errors: 0, Skipped: 0, Time elapsed: 0 sec - in org.apache.hc.core5.http.impl.nio.TestErrorResponseProducer
Running org.apache.hc.core5.http.impl.nio.TestIdentityDecoder
Tests run: 8, Failures: 0, Errors: 0, Skipped: 0, Time elapsed: 0.003 sec - in org.apache.hc.core5.http.impl.nio.TestIdentityDecoder
Running org.apache.hc.core5.http.impl.nio.TestBasicAsyncRequestProducer
Tests run: 11, Failures: 0, Errors: 0, Skipped: 0, Time elapsed: 0.012 sec - in org.apache.hc.core5.http.impl.nio.TestBasicAsyncRequestProducer
Running org.apache.hc.core5.http.impl.nio.TestBuffers
Tests run: 7, Failures: 0, Errors: 0, Skipped: 0, Time elapsed: 0.003 sec - in org.apache.hc.core5.http.impl.nio.TestBuffers
Running org.apache.hc.core5.http.impl.nio.TestChunkEncoder
Tests run: 9, Failures: 0, Errors: 0, Skipped: 0, Time elapsed: 0.003 sec - in org.apache.hc.core5.http.impl.nio.TestChunkEncoder
Running org.apache.hc.core5.http.impl.nio.TestBasicAsyncClientExchangeHandler
Tests run: 17, Failures: 0, Errors: 0, Skipped: 0, Time elapsed: 0.028 sec - in org.apache.hc.core5.http.impl.nio.TestBasicAsyncClientExchangeHandler
Running org.apache.hc.core5.http.impl.nio.ExceptionEventTest
Tests run: 3, Failures: 0, Errors: 0, Skipped: 0, Time elapsed: 0 sec - in org.apache.hc.core5.http.impl.nio.ExceptionEventTest
Running org.apache.hc.core5.http.impl.nio.TestDefaultNHttpServerConnection
Tests run: 17, Failures: 0, Errors: 0, Skipped: 0, Time elapsed: 0.013 sec - in org.apache.hc.core5.http.impl.nio.TestDefaultNHttpServerConnection
Running org.apache.hc.core5.http.impl.nio.TestHttpAsyncRequester
Tests run: 9, Failures: 0, Errors: 0, Skipped: 0, Time elapsed: 0.023 sec - in org.apache.hc.core5.http.impl.nio.TestHttpAsyncRequester
Running org.apache.hc.core5.http.impl.io.TestIdentityInputStream
Tests run: 3, Failures: 0, Errors: 0, Skipped: 0, Time elapsed: 0 sec - in org.apache.hc.core5.http.impl.io.TestIdentityInputStream
Running org.apache.hc.core5.http.impl.io.TestIdentityOutputStream
Tests run: 4, Failures: 0, Errors: 0, Skipped: 0, Time elapsed: 0.001 sec - in org.apache.hc.core5.http.impl.io.TestIdentityOutputStream
Running org.apache.hc.core5.http.impl.io.TestResponseParser
Tests run: 6, Failures: 0, Errors: 0, Skipped: 0, Time elapsed: 0.004 sec - in org.apache.hc.core5.http.impl.io.TestResponseParser
Running org.apache.hc.core5.http.impl.io.TestMessageParser
Tests run: 7, Failures: 0, Errors: 0, Skipped: 0, Time elapsed: 0.004 sec - in org.apache.hc.core5.http.impl.io.TestMessageParser
Running org.apache.hc.core5.http.impl.io.TestContentLengthInputStream
Tests run: 5, Failures: 0, Errors: 0, Skipped: 0, Time elapsed: 0.002 sec - in org.apache.hc.core5.http.impl.io.TestContentLengthInputStream
Running org.apache.hc.core5.http.impl.io.TestDefaultBHttpServerConnection
Tests run: 12, Failures: 0, Errors: 0, Skipped: 0, Time elapsed: 0.017 sec - in org.apache.hc.core5.http.impl.io.TestDefaultBHttpServerConnection
Running org.apache.hc.core5.http.impl.io.TestContentLengthOutputStream
Tests run: 2, Failures: 0, Errors: 0, Skipped: 0, Time elapsed: 0.001 sec - in org.apache.hc.core5.http.impl.io.TestContentLengthOutputStream
Running org.apache.hc.core5.http.impl.io.TestHttpService
Tests run: 13, Failures: 0, Errors: 0, Skipped: 0, Time elapsed: 0.053 sec - in org.apache.hc.core5.http.impl.io.TestHttpService
Running org.apache.hc.core5.http.impl.io.TestRequestParser
Tests run: 6, Failures: 0, Errors: 0, Skipped: 0, Time elapsed: 0.002 sec - in org.apache.hc.core5.http.impl.io.TestRequestParser
Running org.apache.hc.core5.http.impl.io.TestDefaultBHttpClientConnection
Tests run: 14, Failures: 0, Errors: 0, Skipped: 0, Time elapsed: 0.012 sec - in org.apache.hc.core5.http.impl.io.TestDefaultBHttpClientConnection
Running org.apache.hc.core5.http.impl.io.TestSessionInOutBuffers
Tests run: 20, Failures: 0, Errors: 0, Skipped: 0, Time elapsed: 0.046 sec - in org.apache.hc.core5.http.impl.io.TestSessionInOutBuffers
Running org.apache.hc.core5.http.impl.io.TestHttpRequestExecutor
Tests run: 12, Failures: 0, Errors: 0, Skipped: 0, Time elapsed: 0.031 sec - in org.apache.hc.core5.http.impl.io.TestHttpRequestExecutor
Running org.apache.hc.core5.http.impl.io.TestBHttpConnectionBase
Tests run: 19, Failures: 0, Errors: 0, Skipped: 0, Time elapsed: 0.046 sec - in org.apache.hc.core5.http.impl.io.TestBHttpConnectionBase
Running org.apache.hc.core5.http.impl.io.TestChunkCoding
Tests run: 24, Failures: 0, Errors: 0, Skipped: 0, Time elapsed: 0.009 sec - in org.apache.hc.core5.http.impl.io.TestChunkCoding
Running org.apache.hc.core5.http.impl.TestEnglishReasonPhraseCatalog
Tests run: 3, Failures: 0, Errors: 0, Skipped: 0, Time elapsed: 0.003 sec - in org.apache.hc.core5.http.impl.TestEnglishReasonPhraseCatalog

Results :

Tests run: 1090, Failures: 0, Errors: 0, Skipped: 0

[JENKINS] Recording test results
[INFO] 
[INFO] --- maven-jar-plugin:2.6:jar (default-jar) @ httpcore5 ---
[INFO] Building jar: <https://builds.apache.org/job/httpcomponents-core-5.x/ws/httpcore-5.0.x/httpcore5/target/httpcore5-5.0-alpha2-SNAPSHOT.jar>
[INFO] 
[INFO] >>> maven-source-plugin:2.2.1:jar (attach-sources) @ httpcore5 >>>
[INFO] 
[INFO] --- maven-checkstyle-plugin:2.9.1:checkstyle (validate) @ httpcore5 ---
[INFO] Starting audit...
Audit done.

[INFO] 
[INFO] --- maven-checkstyle-plugin:2.9.1:checkstyle (validate-main) @ httpcore5 ---
[INFO] Starting audit...
Audit done.

[INFO] 
[INFO] --- maven-checkstyle-plugin:2.9.1:checkstyle (validate-test) @ httpcore5 ---
[INFO] Starting audit...
Audit done.

[INFO] 
[INFO] --- maven-checkstyle-plugin:2.9.1:checkstyle (validate-examples) @ httpcore5 ---
[INFO] Starting audit...
Audit done.

[WARNING] Failed to getClass for org.apache.maven.plugin.source.SourceJarMojo
[INFO] 
[INFO] <<< maven-source-plugin:2.2.1:jar (attach-sources) @ httpcore5 <<<
[INFO] 
[INFO] --- maven-source-plugin:2.2.1:jar (attach-sources) @ httpcore5 ---
[INFO] Building jar: <https://builds.apache.org/job/httpcomponents-core-5.x/ws/httpcore-5.0.x/httpcore5/target/httpcore5-5.0-alpha2-SNAPSHOT-sources.jar>
[INFO] 
[INFO] --- maven-javadoc-plugin:2.9.1:jar (attach-javadocs) @ httpcore5 ---
[INFO] 
2 warnings
[WARNING] Javadoc Warnings
[WARNING] <https://builds.apache.org/job/httpcomponents-core-5.x/ws/httpcore-5.0.x/httpcore5/src/main/java/org/apache/hc/core5/http/message/LazyLaxLineParser.java>:52:
warning - Tag @link: can't find getElements() in org.apache.hc.core5.http.Header
[WARNING] <https://builds.apache.org/job/httpcomponents-core-5.x/ws/httpcore-5.0.x/httpcore5/src/main/java/org/apache/hc/core5/http/message/LazyLineParser.java>:47:
warning - Tag @link: can't find getElements() in org.apache.hc.core5.http.Header
[INFO] Building jar: <https://builds.apache.org/job/httpcomponents-core-5.x/ws/httpcore-5.0.x/httpcore5/target/httpcore5-5.0-alpha2-SNAPSHOT-javadoc.jar>
[INFO] 
[INFO] --- maven-site-plugin:3.3:attach-descriptor (attach-descriptor) @ httpcore5 ---
[INFO] 
[INFO] --- maven-jar-plugin:2.6:test-jar (default) @ httpcore5 ---
[INFO] Building jar: <https://builds.apache.org/job/httpcomponents-core-5.x/ws/httpcore-5.0.x/httpcore5/target/httpcore5-5.0-alpha2-SNAPSHOT-tests.jar>
[INFO] 
[INFO] --- apache-rat-plugin:0.11:check (default) @ httpcore5 ---
[INFO] 51 implicit excludes (use -debug for more details).
[INFO] Exclude: .externalToolBuilders/**
[INFO] Exclude: .pmd
[INFO] Exclude: maven-eclipse.xml
[INFO] 527 resources included (use -debug for more details)
Warning:  org.apache.xerces.jaxp.SAXParserImpl$JAXPSAXParser: Property 'http://www.oracle.com/xml/jaxp/properties/entityExpansionLimit'
is not recognized.
Compiler warnings:
  WARNING:  'org.apache.xerces.jaxp.SAXParserImpl: Property 'http://javax.xml.XMLConstants/property/accessExternalDTD'
is not recognized.'
Warning:  org.apache.xerces.parsers.SAXParser: Feature 'http://javax.xml.XMLConstants/feature/secure-processing'
is not recognized.
Warning:  org.apache.xerces.parsers.SAXParser: Property 'http://javax.xml.XMLConstants/property/accessExternalDTD'
is not recognized.
Warning:  org.apache.xerces.parsers.SAXParser: Property 'http://www.oracle.com/xml/jaxp/properties/entityExpansionLimit'
is not recognized.
[INFO] Rat check: Summary of files. Unapproved: 0 unknown: 0 generated: 0 approved: 519 licence.
[INFO] 
[INFO] --- maven-install-plugin:2.4:install (default-install) @ httpcore5 ---
[INFO] Installing <https://builds.apache.org/job/httpcomponents-core-5.x/ws/httpcore-5.0.x/httpcore5/target/httpcore5-5.0-alpha2-SNAPSHOT.jar>
to /home/jenkins/jenkins-slave/maven-repositories/0/org/apache/httpcomponents/core5/httpcore5/5.0-alpha2-SNAPSHOT/httpcore5-5.0-alpha2-SNAPSHOT.jar
[INFO] Installing <https://builds.apache.org/job/httpcomponents-core-5.x/ws/httpcore-5.0.x/httpcore5/pom.xml>
to /home/jenkins/jenkins-slave/maven-repositories/0/org/apache/httpcomponents/core5/httpcore5/5.0-alpha2-SNAPSHOT/httpcore5-5.0-alpha2-SNAPSHOT.pom
[INFO] Installing <https://builds.apache.org/job/httpcomponents-core-5.x/ws/httpcore-5.0.x/httpcore5/target/httpcore5-5.0-alpha2-SNAPSHOT-sources.jar>
to /home/jenkins/jenkins-slave/maven-repositories/0/org/apache/httpcomponents/core5/httpcore5/5.0-alpha2-SNAPSHOT/httpcore5-5.0-alpha2-SNAPSHOT-sources.jar
[INFO] Installing <https://builds.apache.org/job/httpcomponents-core-5.x/ws/httpcore-5.0.x/httpcore5/target/httpcore5-5.0-alpha2-SNAPSHOT-javadoc.jar>
to /home/jenkins/jenkins-slave/maven-repositories/0/org/apache/httpcomponents/core5/httpcore5/5.0-alpha2-SNAPSHOT/httpcore5-5.0-alpha2-SNAPSHOT-javadoc.jar
[INFO] Installing <https://builds.apache.org/job/httpcomponents-core-5.x/ws/httpcore-5.0.x/httpcore5/target/httpcore5-5.0-alpha2-SNAPSHOT-tests.jar>
to /home/jenkins/jenkins-slave/maven-repositories/0/org/apache/httpcomponents/core5/httpcore5/5.0-alpha2-SNAPSHOT/httpcore5-5.0-alpha2-SNAPSHOT-tests.jar
[INFO]                                                                         
[INFO] ------------------------------------------------------------------------
[INFO] Building Apache HttpComponents Core HTTP/2 5.0-alpha2-SNAPSHOT
[INFO] ------------------------------------------------------------------------
[INFO] 
[INFO] --- maven-clean-plugin:2.5:clean (default-clean) @ httpcore5-h2 ---
[INFO] Deleting <https://builds.apache.org/job/httpcomponents-core-5.x/ws/httpcore-5.0.x/httpcore5-h2/target>
[INFO] 
[INFO] --- maven-checkstyle-plugin:2.9.1:checkstyle (validate) @ httpcore5-h2 ---
[INFO] Starting audit...
<https://builds.apache.org/job/httpcomponents-core-5.x/ws/httpcore-5.0.x/httpcore5-h2/src/main/java/org/apache/hc/core5/http2/hpack/Huffman.java>:39:
Trailing whitespace
<https://builds.apache.org/job/httpcomponents-core-5.x/ws/httpcore-5.0.x/httpcore5-h2/src/main/java/org/apache/hc/core5/http2/frame/FrameConsts.java>:34:
Trailing whitespace
Audit done.

[INFO] ------------------------------------------------------------------------
[INFO] Reactor Summary:
[INFO] 
[INFO] Apache HttpComponents Core Parent ................. SUCCESS [ 18.010 s]
[INFO] Apache HttpComponents Core HTTP/1.1 ............... SUCCESS [01:11 min]
[INFO] Apache HttpComponents Core HTTP/2 ................. FAILURE [  0.577 s]
[INFO] Apache HttpComponents Core OSGi bundle ............ SKIPPED
[INFO] Apache HttpComponents Core Benchmarking Tool ...... SKIPPED
[INFO] ------------------------------------------------------------------------
[INFO] BUILD FAILURE
[INFO] ------------------------------------------------------------------------
[INFO] Total time: 01:33 min
[INFO] Finished at: 2016-03-11T21:24:13+00:00
[INFO] Final Memory: 43M/331M
[INFO] ------------------------------------------------------------------------
[ERROR] Failed to execute goal org.apache.maven.plugins:maven-checkstyle-plugin:2.9.1:checkstyle
(validate) on project httpcore5-h2: An error has occurred in Checkstyle report generation.
Failed during checkstyle execution: There are 2 checkstyle errors. -> [Help 1]
[ERROR] 
[ERROR] To see the full stack trace of the errors, re-run Maven with the -e switch.
[ERROR] Re-run Maven using the -X switch to enable full debug logging.
[ERROR] 
[ERROR] For more information about the errors and possible solutions, please read the following
articles:
[ERROR] [Help 1] http://cwiki.apache.org/confluence/display/MAVEN/MojoExecutionException
[ERROR] 
[ERROR] After correcting the problems, you can resume the build with the command
[ERROR]   mvn <goals> -rf :httpcore5-h2
[JENKINS] Archiving <https://builds.apache.org/job/httpcomponents-core-5.x/ws/httpcore-5.0.x/httpcore5/pom.xml>
to org.apache.httpcomponents.core5/httpcore5/5.0-alpha2-SNAPSHOT/httpcore5-5.0-alpha2-SNAPSHOT.pom
[JENKINS] Archiving <https://builds.apache.org/job/httpcomponents-core-5.x/ws/httpcore-5.0.x/httpcore5/target/httpcore5-5.0-alpha2-SNAPSHOT.jar>
to org.apache.httpcomponents.core5/httpcore5/5.0-alpha2-SNAPSHOT/httpcore5-5.0-alpha2-SNAPSHOT.jar
[JENKINS] Archiving <https://builds.apache.org/job/httpcomponents-core-5.x/ws/httpcore-5.0.x/httpcore5/target/httpcore5-5.0-alpha2-SNAPSHOT-sources.jar>
to org.apache.httpcomponents.core5/httpcore5/5.0-alpha2-SNAPSHOT/httpcore5-5.0-alpha2-SNAPSHOT-sources.jar
[JENKINS] Archiving <https://builds.apache.org/job/httpcomponents-core-5.x/ws/httpcore-5.0.x/httpcore5/target/httpcore5-5.0-alpha2-SNAPSHOT-javadoc.jar>
to org.apache.httpcomponents.core5/httpcore5/5.0-alpha2-SNAPSHOT/httpcore5-5.0-alpha2-SNAPSHOT-javadoc.jar
[JENKINS] Archiving <https://builds.apache.org/job/httpcomponents-core-5.x/ws/httpcore-5.0.x/httpcore5/target/httpcore5-5.0-alpha2-SNAPSHOT-tests.jar>
to org.apache.httpcomponents.core5/httpcore5/5.0-alpha2-SNAPSHOT/httpcore5-5.0-alpha2-SNAPSHOT-tests.jar
Compressed 3.56 MB of artifacts by 11.4% relative to #92
[JENKINS] Archiving <https://builds.apache.org/job/httpcomponents-core-5.x/ws/httpcore-5.0.x/httpcore5-h2/pom.xml>
to org.apache.httpcomponents.core5/httpcore5-h2/5.0-alpha2-SNAPSHOT/httpcore5-h2-5.0-alpha2-SNAPSHOT.pom
[JENKINS] Archiving <https://builds.apache.org/job/httpcomponents-core-5.x/ws/httpcore-5.0.x/httpcore5-ab/pom.xml>
to org.apache.httpcomponents.core5/httpcore5-ab/5.0-alpha2-SNAPSHOT/httpcore5-ab-5.0-alpha2-SNAPSHOT.pom
[JENKINS] Archiving <https://builds.apache.org/job/httpcomponents-core-5.x/ws/httpcore-5.0.x/httpcore5-osgi/pom.xml>
to org.apache.httpcomponents.core5/httpcore5-osgi/5.0-alpha2-SNAPSHOT/httpcore5-osgi-5.0-alpha2-SNAPSHOT.pom
[JENKINS] Archiving <https://builds.apache.org/job/httpcomponents-core-5.x/ws/httpcore-5.0.x/pom.xml>
to org.apache.httpcomponents.core5/httpcore5-parent/5.0-alpha2-SNAPSHOT/httpcore5-parent-5.0-alpha2-SNAPSHOT.pom
Sending e-mails to: commits@hc.apache.org
Sending e-mails to: commits@hc.apache.org
channel stopped

Mime
View raw message