hc-commits mailing list archives

Site index · List index
Message view « Date » · « Thread »
Top « Date » · « Thread »
From Apache Jenkins Server <jenk...@builds.apache.org>
Subject Build failed in Jenkins: httpcomponents-core-5.x #71
Date Sat, 05 Dec 2015 13:05:18 GMT
See <https://builds.apache.org/job/httpcomponents-core-5.x/71/changes>

Changes:

[olegk] Removed IllegalStateException from method declarations

[olegk] Updated version.properties

[olegk] Changed artifactIds to include major project version (httpcore -> httpcore5)

------------------------------------------
[...truncated 338 lines...]
Tests run: 8, Failures: 0, Errors: 0, Skipped: 0, Time elapsed: 0.002 sec - in org.apache.hc.core5.http.impl.nio.TestIdentityDecoder
Running org.apache.hc.core5.http.impl.nio.TestBasicAsyncRequestProducer
Tests run: 11, Failures: 0, Errors: 0, Skipped: 0, Time elapsed: 0.011 sec - in org.apache.hc.core5.http.impl.nio.TestBasicAsyncRequestProducer
Running org.apache.hc.core5.http.impl.nio.TestBuffers
Tests run: 7, Failures: 0, Errors: 0, Skipped: 0, Time elapsed: 0.002 sec - in org.apache.hc.core5.http.impl.nio.TestBuffers
Running org.apache.hc.core5.http.impl.nio.TestChunkEncoder
Tests run: 9, Failures: 0, Errors: 0, Skipped: 0, Time elapsed: 0.002 sec - in org.apache.hc.core5.http.impl.nio.TestChunkEncoder
Running org.apache.hc.core5.http.impl.nio.TestBasicAsyncClientExchangeHandler
Tests run: 17, Failures: 0, Errors: 0, Skipped: 0, Time elapsed: 0.025 sec - in org.apache.hc.core5.http.impl.nio.TestBasicAsyncClientExchangeHandler
Running org.apache.hc.core5.http.impl.nio.ExceptionEventTest
Tests run: 3, Failures: 0, Errors: 0, Skipped: 0, Time elapsed: 0.001 sec - in org.apache.hc.core5.http.impl.nio.ExceptionEventTest
Running org.apache.hc.core5.http.impl.nio.TestDefaultNHttpServerConnection
Tests run: 17, Failures: 0, Errors: 0, Skipped: 0, Time elapsed: 0.045 sec - in org.apache.hc.core5.http.impl.nio.TestDefaultNHttpServerConnection
Running org.apache.hc.core5.http.impl.nio.TestHttpAsyncRequester
Tests run: 9, Failures: 0, Errors: 0, Skipped: 0, Time elapsed: 0.022 sec - in org.apache.hc.core5.http.impl.nio.TestHttpAsyncRequester
Running org.apache.hc.core5.http.impl.io.TestIdentityInputStream
Tests run: 4, Failures: 0, Errors: 0, Skipped: 0, Time elapsed: 0.001 sec - in org.apache.hc.core5.http.impl.io.TestIdentityInputStream
Running org.apache.hc.core5.http.impl.io.TestIdentityOutputStream
Tests run: 6, Failures: 0, Errors: 0, Skipped: 0, Time elapsed: 0.001 sec - in org.apache.hc.core5.http.impl.io.TestIdentityOutputStream
Running org.apache.hc.core5.http.impl.io.TestResponseParser
Tests run: 6, Failures: 0, Errors: 0, Skipped: 0, Time elapsed: 0.001 sec - in org.apache.hc.core5.http.impl.io.TestResponseParser
Running org.apache.hc.core5.http.impl.io.TestMessageParser
Tests run: 8, Failures: 0, Errors: 0, Skipped: 0, Time elapsed: 0.001 sec - in org.apache.hc.core5.http.impl.io.TestMessageParser
Running org.apache.hc.core5.http.impl.io.TestContentLengthInputStream
Tests run: 6, Failures: 0, Errors: 0, Skipped: 0, Time elapsed: 0.001 sec - in org.apache.hc.core5.http.impl.io.TestContentLengthInputStream
Running org.apache.hc.core5.http.impl.io.TestDefaultBHttpServerConnection
Tests run: 12, Failures: 0, Errors: 0, Skipped: 0, Time elapsed: 0.01 sec - in org.apache.hc.core5.http.impl.io.TestDefaultBHttpServerConnection
Running org.apache.hc.core5.http.impl.io.TestContentLengthOutputStream
Tests run: 3, Failures: 0, Errors: 0, Skipped: 0, Time elapsed: 0 sec - in org.apache.hc.core5.http.impl.io.TestContentLengthOutputStream
Running org.apache.hc.core5.http.impl.io.TestHttpService
Tests run: 13, Failures: 0, Errors: 0, Skipped: 0, Time elapsed: 0.046 sec - in org.apache.hc.core5.http.impl.io.TestHttpService
Running org.apache.hc.core5.http.impl.io.TestRequestParser
Tests run: 6, Failures: 0, Errors: 0, Skipped: 0, Time elapsed: 0.001 sec - in org.apache.hc.core5.http.impl.io.TestRequestParser
Running org.apache.hc.core5.http.impl.io.TestDefaultBHttpClientConnection
Tests run: 14, Failures: 0, Errors: 0, Skipped: 0, Time elapsed: 0.013 sec - in org.apache.hc.core5.http.impl.io.TestDefaultBHttpClientConnection
Running org.apache.hc.core5.http.impl.io.TestSessionInOutBuffers
Tests run: 21, Failures: 0, Errors: 0, Skipped: 0, Time elapsed: 0.051 sec - in org.apache.hc.core5.http.impl.io.TestSessionInOutBuffers
Running org.apache.hc.core5.http.impl.io.TestHttpRequestExecutor
Tests run: 12, Failures: 0, Errors: 0, Skipped: 0, Time elapsed: 0.026 sec - in org.apache.hc.core5.http.impl.io.TestHttpRequestExecutor
Running org.apache.hc.core5.http.impl.io.TestBHttpConnectionBase
Tests run: 19, Failures: 0, Errors: 0, Skipped: 0, Time elapsed: 0.033 sec - in org.apache.hc.core5.http.impl.io.TestBHttpConnectionBase
Running org.apache.hc.core5.http.impl.io.TestChunkCoding
Tests run: 25, Failures: 0, Errors: 0, Skipped: 0, Time elapsed: 0.006 sec - in org.apache.hc.core5.http.impl.io.TestChunkCoding
Running org.apache.hc.core5.http.impl.TestEnglishReasonPhraseCatalog
Tests run: 3, Failures: 0, Errors: 0, Skipped: 0, Time elapsed: 0 sec - in org.apache.hc.core5.http.impl.TestEnglishReasonPhraseCatalog

Results :

Tests run: 1100, Failures: 0, Errors: 0, Skipped: 0

[JENKINS] Recording test results
log4j:WARN No appenders could be found for logger (org.apache.commons.beanutils.converters.BooleanConverter).
log4j:WARN Please initialize the log4j system properly.
[INFO] 
[INFO] --- maven-jar-plugin:2.6:jar (default-jar) @ httpcore5 ---
[INFO] Building jar: <https://builds.apache.org/job/httpcomponents-core-5.x/ws/httpcore-trunk/httpcore/target/httpcore5-5.0-alpha1-SNAPSHOT.jar>
[INFO] 
[INFO] >>> maven-source-plugin:2.2.1:jar (attach-sources) @ httpcore5 >>>
[INFO] 
[INFO] --- maven-checkstyle-plugin:2.9.1:checkstyle (validate) @ httpcore5 ---
[INFO] Starting audit...
Audit done.

[INFO] 
[INFO] --- maven-checkstyle-plugin:2.9.1:checkstyle (validate-main) @ httpcore5 ---
[INFO] Starting audit...
Audit done.

[INFO] 
[INFO] --- maven-checkstyle-plugin:2.9.1:checkstyle (validate-test) @ httpcore5 ---
[INFO] Starting audit...
Audit done.

[INFO] 
[INFO] --- maven-checkstyle-plugin:2.9.1:checkstyle (validate-examples) @ httpcore5 ---
[INFO] Starting audit...
Audit done.

[WARNING] Failed to getClass for org.apache.maven.plugin.source.SourceJarMojo
[INFO] 
[INFO] <<< maven-source-plugin:2.2.1:jar (attach-sources) @ httpcore5 <<<
[INFO] 
[INFO] --- maven-source-plugin:2.2.1:jar (attach-sources) @ httpcore5 ---
[INFO] Building jar: <https://builds.apache.org/job/httpcomponents-core-5.x/ws/httpcore-trunk/httpcore/target/httpcore5-5.0-alpha1-SNAPSHOT-sources.jar>
[INFO] 
[INFO] --- maven-javadoc-plugin:2.9.1:jar (attach-javadocs) @ httpcore5 ---
[INFO] 
2 warnings
[WARNING] Javadoc Warnings
[WARNING] <https://builds.apache.org/job/httpcomponents-core-5.x/ws/httpcore-trunk/httpcore/src/main/java/org/apache/hc/core5/http/HttpMessage.java>:58:
warning - Tag @link: can't find toString() in org.apache.hc.core5.http.HttpMessage
[WARNING] <https://builds.apache.org/job/httpcomponents-core-5.x/ws/httpcore-trunk/httpcore/src/main/java/org/apache/hc/core5/http/HttpMessage.java>:75:
warning - Tag @link: can't find toString() in org.apache.hc.core5.http.HttpMessage
[INFO] Building jar: <https://builds.apache.org/job/httpcomponents-core-5.x/ws/httpcore-trunk/httpcore/target/httpcore5-5.0-alpha1-SNAPSHOT-javadoc.jar>
[INFO] 
[INFO] --- maven-site-plugin:3.3:attach-descriptor (attach-descriptor) @ httpcore5 ---
[INFO] 
[INFO] --- maven-jar-plugin:2.6:test-jar (default) @ httpcore5 ---
[INFO] Building jar: <https://builds.apache.org/job/httpcomponents-core-5.x/ws/httpcore-trunk/httpcore/target/httpcore5-5.0-alpha1-SNAPSHOT-tests.jar>
[INFO] 
[INFO] --- apache-rat-plugin:0.11:check (default) @ httpcore5 ---
[INFO] 51 implicit excludes (use -debug for more details).
[INFO] Exclude: .externalToolBuilders/**
[INFO] Exclude: .pmd
[INFO] Exclude: maven-eclipse.xml
[INFO] 529 resources included (use -debug for more details)
Warning:  org.apache.xerces.jaxp.SAXParserImpl$JAXPSAXParser: Property 'http://www.oracle.com/xml/jaxp/properties/entityExpansionLimit'
is not recognized.
Compiler warnings:
  WARNING:  'org.apache.xerces.jaxp.SAXParserImpl: Property 'http://javax.xml.XMLConstants/property/accessExternalDTD'
is not recognized.'
Warning:  org.apache.xerces.parsers.SAXParser: Feature 'http://javax.xml.XMLConstants/feature/secure-processing'
is not recognized.
Warning:  org.apache.xerces.parsers.SAXParser: Property 'http://javax.xml.XMLConstants/property/accessExternalDTD'
is not recognized.
Warning:  org.apache.xerces.parsers.SAXParser: Property 'http://www.oracle.com/xml/jaxp/properties/entityExpansionLimit'
is not recognized.
[INFO] Rat check: Summary of files. Unapproved: 0 unknown: 0 generated: 0 approved: 521 licence.
[INFO] 
[INFO] --- maven-install-plugin:2.4:install (default-install) @ httpcore5 ---
[INFO] Installing <https://builds.apache.org/job/httpcomponents-core-5.x/ws/httpcore-trunk/httpcore/target/httpcore5-5.0-alpha1-SNAPSHOT.jar>
to /home/jenkins/jenkins-slave/maven-repositories/0/org/apache/httpcomponents/core5/httpcore5/5.0-alpha1-SNAPSHOT/httpcore5-5.0-alpha1-SNAPSHOT.jar
[INFO] Installing <https://builds.apache.org/job/httpcomponents-core-5.x/ws/httpcore-trunk/httpcore/pom.xml>
to /home/jenkins/jenkins-slave/maven-repositories/0/org/apache/httpcomponents/core5/httpcore5/5.0-alpha1-SNAPSHOT/httpcore5-5.0-alpha1-SNAPSHOT.pom
[INFO] Installing <https://builds.apache.org/job/httpcomponents-core-5.x/ws/httpcore-trunk/httpcore/target/httpcore5-5.0-alpha1-SNAPSHOT-sources.jar>
to /home/jenkins/jenkins-slave/maven-repositories/0/org/apache/httpcomponents/core5/httpcore5/5.0-alpha1-SNAPSHOT/httpcore5-5.0-alpha1-SNAPSHOT-sources.jar
[INFO] Installing <https://builds.apache.org/job/httpcomponents-core-5.x/ws/httpcore-trunk/httpcore/target/httpcore5-5.0-alpha1-SNAPSHOT-javadoc.jar>
to /home/jenkins/jenkins-slave/maven-repositories/0/org/apache/httpcomponents/core5/httpcore5/5.0-alpha1-SNAPSHOT/httpcore5-5.0-alpha1-SNAPSHOT-javadoc.jar
[INFO] Installing <https://builds.apache.org/job/httpcomponents-core-5.x/ws/httpcore-trunk/httpcore/target/httpcore5-5.0-alpha1-SNAPSHOT-tests.jar>
to /home/jenkins/jenkins-slave/maven-repositories/0/org/apache/httpcomponents/core5/httpcore5/5.0-alpha1-SNAPSHOT/httpcore5-5.0-alpha1-SNAPSHOT-tests.jar
[INFO]                                                                         
[INFO] ------------------------------------------------------------------------
[INFO] Building Apache HttpComponents Core OSGi bundle 5.0-alpha1-SNAPSHOT
[INFO] ------------------------------------------------------------------------
[INFO] Downloading: http://repository.apache.org/snapshots/org/apache/httpcomponents/httpcore/5.0-alpha1-SNAPSHOT/maven-metadata.xml
[INFO] Downloaded: http://repository.apache.org/snapshots/org/apache/httpcomponents/httpcore/5.0-alpha1-SNAPSHOT/maven-metadata.xml
(2 KB at 2.5 KB/sec)
[INFO] Downloading: http://repository.apache.org/snapshots/org/apache/httpcomponents/httpcomponents-core/5.0-alpha1-SNAPSHOT/maven-metadata.xml
[INFO] Downloaded: http://repository.apache.org/snapshots/org/apache/httpcomponents/httpcomponents-core/5.0-alpha1-SNAPSHOT/maven-metadata.xml
(631 B at 3.5 KB/sec)
[INFO] 
[INFO] --- maven-clean-plugin:2.5:clean (default-clean) @ httpcore5-osgi ---
[INFO] Deleting <https://builds.apache.org/job/httpcomponents-core-5.x/ws/httpcore-trunk/httpcore-osgi/target>
[INFO] 
[INFO] --- maven-checkstyle-plugin:2.9.1:checkstyle (validate) @ httpcore5-osgi ---
[INFO] 
[INFO] --- maven-checkstyle-plugin:2.9.1:checkstyle (validate-main) @ httpcore5-osgi ---
[INFO] Starting audit...
Audit done.

[INFO] 
[INFO] --- maven-checkstyle-plugin:2.9.1:checkstyle (validate-test) @ httpcore5-osgi ---
[INFO] Starting audit...
Audit done.

[INFO] 
[INFO] --- maven-checkstyle-plugin:2.9.1:checkstyle (validate-examples) @ httpcore5-osgi ---
[INFO] 
[INFO] --- maven-remote-resources-plugin:1.4:process (default) @ httpcore5-osgi ---
[INFO] 
[INFO] --- buildnumber-maven-plugin:1.2:create (default) @ httpcore5-osgi ---
[INFO] Checking for local modifications: skipped.
[INFO] Updating project files from SCM: skipped.
[INFO] Executing: /bin/sh -c cd <https://builds.apache.org/job/httpcomponents-core-5.x/ws/httpcore-trunk/httpcore-osgi>
&& svn --non-interactive info
[INFO] Working directory: <https://builds.apache.org/job/httpcomponents-core-5.x/ws/httpcore-trunk/httpcore-osgi>
[INFO] Storing buildNumber: 1718073 at timestamp: 1449320722749
[INFO] Executing: /bin/sh -c cd <https://builds.apache.org/job/httpcomponents-core-5.x/ws/httpcore-trunk/httpcore-osgi>
&& svn --non-interactive info
[INFO] Working directory: <https://builds.apache.org/job/httpcomponents-core-5.x/ws/httpcore-trunk/httpcore-osgi>
[INFO] Storing buildScmBranch: trunk
[INFO] 
[INFO] --- depends-maven-plugin:1.2:generate-depends-file (generate-depends-file) @ httpcore5-osgi
---
[INFO] Created: <https://builds.apache.org/job/httpcomponents-core-5.x/ws/httpcore-trunk/httpcore-osgi/target/classes/META-INF/maven/dependencies.properties>
[INFO] 
[INFO] --- maven-resources-plugin:2.6:resources (default-resources) @ httpcore5-osgi ---
[INFO] Using 'UTF-8' encoding to copy filtered resources.
[INFO] skip non existing resourceDirectory <https://builds.apache.org/job/httpcomponents-core-5.x/ws/httpcore-trunk/httpcore-osgi/src/main/resources>
[INFO] Copying 3 resources
[INFO] 
[INFO] --- maven-compiler-plugin:3.1:compile (default-compile) @ httpcore5-osgi ---
[INFO] No sources to compile
[INFO] 
[INFO] --- maven-resources-plugin:2.6:testResources (default-testResources) @ httpcore5-osgi
---
[INFO] Using 'UTF-8' encoding to copy filtered resources.
[INFO] Copying 1 resource
[INFO] Copying 3 resources
[INFO] 
[INFO] --- maven-compiler-plugin:3.1:testCompile (default-testCompile) @ httpcore5-osgi ---
[INFO] Changes detected - recompiling the module!
[INFO] Compiling 4 source files to <https://builds.apache.org/job/httpcomponents-core-5.x/ws/httpcore-trunk/httpcore-osgi/target/test-classes>
[INFO] -------------------------------------------------------------
[ERROR] COMPILATION ERROR : 
[INFO] -------------------------------------------------------------
[ERROR] <https://builds.apache.org/job/httpcomponents-core-5.x/ws/httpcore-trunk/httpcore-osgi/src/test/java/org/apache/hc/core5/http/osgi/ActuallyConnectIT.java>:[30,44]
package org.apache.hc.core5.http.integration does not exist
[ERROR] <https://builds.apache.org/job/httpcomponents-core-5.x/ws/httpcore-trunk/httpcore-osgi/src/test/java/org/apache/hc/core5/http/osgi/ActuallyConnectIT.java>:[43,40]
cannot find symbol
  symbol: class TestSyncHttp
[ERROR] <https://builds.apache.org/job/httpcomponents-core-5.x/ws/httpcore-trunk/httpcore-osgi/src/test/java/org/apache/hc/core5/http/osgi/ConcurrentIT.java>:[30,38]
package org.apache.hc.core5.concurrent does not exist
[ERROR] <https://builds.apache.org/job/httpcomponents-core-5.x/ws/httpcore-trunk/httpcore-osgi/src/test/java/org/apache/hc/core5/http/osgi/ConcurrentIT.java>:[31,38]
package org.apache.hc.core5.concurrent does not exist
[ERROR] <https://builds.apache.org/job/httpcomponents-core-5.x/ws/httpcore-trunk/httpcore-osgi/src/test/java/org/apache/hc/core5/http/osgi/AnnotationIT.java>:[30,38]
package org.apache.hc.core5.annotation does not exist
[ERROR] <https://builds.apache.org/job/httpcomponents-core-5.x/ws/httpcore-trunk/httpcore-osgi/src/test/java/org/apache/hc/core5/http/osgi/AnnotationIT.java>:[38,6]
cannot find symbol
  symbol:   class Immutable
  location: class org.apache.hc.core5.http.osgi.AnnotationIT
[ERROR] <https://builds.apache.org/job/httpcomponents-core-5.x/ws/httpcore-trunk/httpcore-osgi/src/test/java/org/apache/hc/core5/http/osgi/ConcurrentIT.java>:[41,13]
cannot find symbol
  symbol:   class BasicFuture
  location: class org.apache.hc.core5.http.osgi.ConcurrentIT
[ERROR] <https://builds.apache.org/job/httpcomponents-core-5.x/ws/httpcore-trunk/httpcore-osgi/src/test/java/org/apache/hc/core5/http/osgi/ConcurrentIT.java>:[41,35]
cannot find symbol
  symbol:   class FutureCallback
  location: class org.apache.hc.core5.http.osgi.ConcurrentIT
[INFO] 8 errors 
[INFO] -------------------------------------------------------------
[INFO] ------------------------------------------------------------------------
[INFO] Reactor Summary:
[INFO] 
[INFO] Apache HttpComponents Core Parent ................. SUCCESS [  8.827 s]
[INFO] Apache HttpComponents Core ........................ SUCCESS [01:00 min]
[INFO] Apache HttpComponents Core OSGi bundle ............ FAILURE [  6.189 s]
[INFO] Apache HttpComponents Core Benchmarking Tool ...... SKIPPED
[INFO] ------------------------------------------------------------------------
[INFO] BUILD FAILURE
[INFO] ------------------------------------------------------------------------
[INFO] Total time: 01:18 min
[INFO] Finished at: 2015-12-05T13:05:24+00:00
[INFO] Final Memory: 58M/299M
[INFO] ------------------------------------------------------------------------
[ERROR] Failed to execute goal org.apache.maven.plugins:maven-compiler-plugin:3.1:testCompile
(default-testCompile) on project httpcore5-osgi: Compilation failure: Compilation failure:
[ERROR] <https://builds.apache.org/job/httpcomponents-core-5.x/ws/httpcore-trunk/httpcore-osgi/src/test/java/org/apache/hc/core5/http/osgi/ActuallyConnectIT.java>:[30,44]
package org.apache.hc.core5.http.integration does not exist
[ERROR] <https://builds.apache.org/job/httpcomponents-core-5.x/ws/httpcore-trunk/httpcore-osgi/src/test/java/org/apache/hc/core5/http/osgi/ActuallyConnectIT.java>:[43,40]
cannot find symbol
[ERROR] symbol: class TestSyncHttp
[ERROR] <https://builds.apache.org/job/httpcomponents-core-5.x/ws/httpcore-trunk/httpcore-osgi/src/test/java/org/apache/hc/core5/http/osgi/ConcurrentIT.java>:[30,38]
package org.apache.hc.core5.concurrent does not exist
[ERROR] <https://builds.apache.org/job/httpcomponents-core-5.x/ws/httpcore-trunk/httpcore-osgi/src/test/java/org/apache/hc/core5/http/osgi/ConcurrentIT.java>:[31,38]
package org.apache.hc.core5.concurrent does not exist
[ERROR] <https://builds.apache.org/job/httpcomponents-core-5.x/ws/httpcore-trunk/httpcore-osgi/src/test/java/org/apache/hc/core5/http/osgi/AnnotationIT.java>:[30,38]
package org.apache.hc.core5.annotation does not exist
[ERROR] <https://builds.apache.org/job/httpcomponents-core-5.x/ws/httpcore-trunk/httpcore-osgi/src/test/java/org/apache/hc/core5/http/osgi/AnnotationIT.java>:[38,6]
cannot find symbol
[ERROR] symbol:   class Immutable
[ERROR] location: class org.apache.hc.core5.http.osgi.AnnotationIT
[ERROR] <https://builds.apache.org/job/httpcomponents-core-5.x/ws/httpcore-trunk/httpcore-osgi/src/test/java/org/apache/hc/core5/http/osgi/ConcurrentIT.java>:[41,13]
cannot find symbol
[ERROR] symbol:   class BasicFuture
[ERROR] location: class org.apache.hc.core5.http.osgi.ConcurrentIT
[ERROR] <https://builds.apache.org/job/httpcomponents-core-5.x/ws/httpcore-trunk/httpcore-osgi/src/test/java/org/apache/hc/core5/http/osgi/ConcurrentIT.java>:[41,35]
cannot find symbol
[ERROR] symbol:   class FutureCallback
[ERROR] location: class org.apache.hc.core5.http.osgi.ConcurrentIT
[ERROR] -> [Help 1]
[ERROR] 
[ERROR] To see the full stack trace of the errors, re-run Maven with the -e switch.
[ERROR] Re-run Maven using the -X switch to enable full debug logging.
[ERROR] 
[ERROR] For more information about the errors and possible solutions, please read the following
articles:
[ERROR] [Help 1] http://cwiki.apache.org/confluence/display/MAVEN/MojoFailureException
[ERROR] 
[ERROR] After correcting the problems, you can resume the build with the command
[ERROR]   mvn <goals> -rf :httpcore5-osgi
[JENKINS] Archiving <https://builds.apache.org/job/httpcomponents-core-5.x/ws/httpcore-trunk/httpcore/pom.xml>
to org.apache.httpcomponents.core5/httpcore5/5.0-alpha1-SNAPSHOT/httpcore5-5.0-alpha1-SNAPSHOT.pom
[JENKINS] Archiving <https://builds.apache.org/job/httpcomponents-core-5.x/ws/httpcore-trunk/httpcore/target/httpcore5-5.0-alpha1-SNAPSHOT.jar>
to org.apache.httpcomponents.core5/httpcore5/5.0-alpha1-SNAPSHOT/httpcore5-5.0-alpha1-SNAPSHOT.jar
[JENKINS] Archiving <https://builds.apache.org/job/httpcomponents-core-5.x/ws/httpcore-trunk/httpcore/target/httpcore5-5.0-alpha1-SNAPSHOT-sources.jar>
to org.apache.httpcomponents.core5/httpcore5/5.0-alpha1-SNAPSHOT/httpcore5-5.0-alpha1-SNAPSHOT-sources.jar
[JENKINS] Archiving <https://builds.apache.org/job/httpcomponents-core-5.x/ws/httpcore-trunk/httpcore/target/httpcore5-5.0-alpha1-SNAPSHOT-javadoc.jar>
to org.apache.httpcomponents.core5/httpcore5/5.0-alpha1-SNAPSHOT/httpcore5-5.0-alpha1-SNAPSHOT-javadoc.jar
[JENKINS] Archiving <https://builds.apache.org/job/httpcomponents-core-5.x/ws/httpcore-trunk/httpcore/target/httpcore5-5.0-alpha1-SNAPSHOT-tests.jar>
to org.apache.httpcomponents.core5/httpcore5/5.0-alpha1-SNAPSHOT/httpcore5-5.0-alpha1-SNAPSHOT-tests.jar
No prior successful build to compare, so performing full copy of artifacts
[JENKINS] Archiving <https://builds.apache.org/job/httpcomponents-core-5.x/ws/httpcore-trunk/httpcore-ab/pom.xml>
to org.apache.httpcomponents.core5/httpcore5-ab/5.0-alpha1-SNAPSHOT/httpcore5-ab-5.0-alpha1-SNAPSHOT.pom
No prior successful build to compare, so performing full copy of artifacts
[JENKINS] Archiving <https://builds.apache.org/job/httpcomponents-core-5.x/ws/httpcore-trunk/httpcore-osgi/pom.xml>
to org.apache.httpcomponents.core5/httpcore5-osgi/5.0-alpha1-SNAPSHOT/httpcore5-osgi-5.0-alpha1-SNAPSHOT.pom
No prior successful build to compare, so performing full copy of artifacts
[JENKINS] Archiving <https://builds.apache.org/job/httpcomponents-core-5.x/ws/httpcore-trunk/pom.xml>
to org.apache.httpcomponents.core5/httpcore5-parent/5.0-alpha1-SNAPSHOT/httpcore5-parent-5.0-alpha1-SNAPSHOT.pom
No prior successful build to compare, so performing full copy of artifacts
Sending e-mails to: commits@hc.apache.org
channel stopped

Mime
View raw message