hc-commits mailing list archives

Site index · List index
Message view « Date » · « Thread »
Top « Date » · « Thread »
From Apache Jenkins Server <jenk...@builds.apache.org>
Subject Build failed in Jenkins: httpcomponents-core-5.x #69
Date Wed, 02 Dec 2015 01:04:19 GMT
See <https://builds.apache.org/job/httpcomponents-core-5.x/69/changes>

Changes:

[ggregory] Add missing '@Override' annotations.

[ggregory] Add final modifier to local variables.

[ggregory] Add final modifier to private fields.

[ggregory] Statement unnecessarily nested within else clause.

[ggregory] Use varargs instead of an array.

[ggregory] Javadoc.

[olegk] Fixed javadoc errors

[olegk] Changed project groupId to org.apache.httpcomponents.core5

[olegk] Renamed Consts to Chars

[olegk] Updated examples to use StandardCharsets

------------------------------------------
[...truncated 581 lines...]
[INFO] 
[INFO] --- maven-source-plugin:2.2.1:jar (attach-sources) @ httpcore-osgi ---
[INFO] Building jar: <https://builds.apache.org/job/httpcomponents-core-5.x/ws/httpcore-trunk/httpcore-osgi/target/org.apache.httpcomponents.httpcore_5.0-alpha1-SNAPSHOT-sources.jar>
[INFO] 
[INFO] --- maven-javadoc-plugin:2.9.1:jar (attach-javadocs) @ httpcore-osgi ---
[INFO] 
[INFO] --- maven-site-plugin:3.3:attach-descriptor (attach-descriptor) @ httpcore-osgi ---
[INFO] 
[INFO] --- maven-failsafe-plugin:2.15:integration-test (it) @ httpcore-osgi ---
[INFO] Tests are skipped.
[INFO] 
[INFO] --- apache-rat-plugin:0.11:check (default) @ httpcore-osgi ---
[INFO] 51 implicit excludes (use -debug for more details).
[INFO] Exclude: .pmd
[INFO] Exclude: src/docbkx/resources/**
[INFO] Exclude: src/test/resources/*.truststore
[INFO] 8 resources included (use -debug for more details)
Warning:  org.apache.xerces.jaxp.SAXParserImpl$JAXPSAXParser: Property 'http://www.oracle.com/xml/jaxp/properties/entityExpansionLimit'
is not recognized.
Compiler warnings:
  WARNING:  'org.apache.xerces.jaxp.SAXParserImpl: Property 'http://javax.xml.XMLConstants/property/accessExternalDTD'
is not recognized.'
Warning:  org.apache.xerces.parsers.SAXParser: Feature 'http://javax.xml.XMLConstants/feature/secure-processing'
is not recognized.
Warning:  org.apache.xerces.parsers.SAXParser: Property 'http://javax.xml.XMLConstants/property/accessExternalDTD'
is not recognized.
Warning:  org.apache.xerces.parsers.SAXParser: Property 'http://www.oracle.com/xml/jaxp/properties/entityExpansionLimit'
is not recognized.
[INFO] Rat check: Summary of files. Unapproved: 0 unknown: 0 generated: 0 approved: 6 licence.
[INFO] 
[INFO] --- maven-failsafe-plugin:2.15:verify (it) @ httpcore-osgi ---
[INFO] Tests are skipped.
[INFO] 
[INFO] --- maven-install-plugin:2.4:install (default-install) @ httpcore-osgi ---
[INFO] Installing <https://builds.apache.org/job/httpcomponents-core-5.x/ws/httpcore-trunk/httpcore-osgi/target/org.apache.httpcomponents.httpcore_5.0-alpha1-SNAPSHOT.jar>
to /home/jenkins/jenkins-slave/maven-repositories/1/org/apache/httpcomponents/core5/httpcore-osgi/5.0-alpha1-SNAPSHOT/httpcore-osgi-5.0-alpha1-SNAPSHOT.jar
[INFO] Installing <https://builds.apache.org/job/httpcomponents-core-5.x/ws/httpcore-trunk/httpcore-osgi/pom.xml>
to /home/jenkins/jenkins-slave/maven-repositories/1/org/apache/httpcomponents/core5/httpcore-osgi/5.0-alpha1-SNAPSHOT/httpcore-osgi-5.0-alpha1-SNAPSHOT.pom
[INFO] Installing <https://builds.apache.org/job/httpcomponents-core-5.x/ws/httpcore-trunk/httpcore-osgi/target/org.apache.httpcomponents.httpcore_5.0-alpha1-SNAPSHOT-sources.jar>
to /home/jenkins/jenkins-slave/maven-repositories/1/org/apache/httpcomponents/core5/httpcore-osgi/5.0-alpha1-SNAPSHOT/httpcore-osgi-5.0-alpha1-SNAPSHOT-sources.jar
[INFO] 
[INFO] --- maven-bundle-plugin:2.4.0:install (default-install) @ httpcore-osgi ---
[WARNING] Exception while updating local OBR: Unable to read repository xml: file:/home/jenkins/jenkins-slave/maven-repositories/1/repository.xml
org.apache.maven.plugin.MojoExecutionException: Unable to read repository xml: file:/home/jenkins/jenkins-slave/maven-repositories/1/repository.xml
	at org.apache.felix.obrplugin.ObrUpdate.parseRepositoryXml(ObrUpdate.java:324)
	at org.apache.felix.obrplugin.ObrInstall.execute(ObrInstall.java:143)
	at org.apache.maven.plugin.DefaultBuildPluginManager.executeMojo(DefaultBuildPluginManager.java:133)
	at org.apache.maven.lifecycle.internal.MojoExecutor.execute(MojoExecutor.java:208)
	at org.apache.maven.lifecycle.internal.MojoExecutor.execute(MojoExecutor.java:153)
	at org.apache.maven.lifecycle.internal.MojoExecutor.execute(MojoExecutor.java:145)
	at org.apache.maven.lifecycle.internal.LifecycleModuleBuilder.buildProject(LifecycleModuleBuilder.java:108)
	at org.apache.maven.lifecycle.internal.LifecycleModuleBuilder.buildProject(LifecycleModuleBuilder.java:76)
	at org.apache.maven.lifecycle.internal.builder.singlethreaded.SingleThreadedBuilder.build(SingleThreadedBuilder.java:51)
	at org.apache.maven.lifecycle.internal.LifecycleStarter.execute(LifecycleStarter.java:116)
	at org.apache.maven.DefaultMaven.doExecute(DefaultMaven.java:361)
	at org.apache.maven.DefaultMaven.execute(DefaultMaven.java:155)
	at org.jvnet.hudson.maven3.launcher.Maven32Launcher.main(Maven32Launcher.java:132)
	at sun.reflect.NativeMethodAccessorImpl.invoke0(Native Method)
	at sun.reflect.NativeMethodAccessorImpl.invoke(NativeMethodAccessorImpl.java:57)
	at sun.reflect.DelegatingMethodAccessorImpl.invoke(DelegatingMethodAccessorImpl.java:43)
	at java.lang.reflect.Method.invoke(Method.java:606)
	at org.codehaus.plexus.classworlds.launcher.Launcher.launchStandard(Launcher.java:330)
	at org.codehaus.plexus.classworlds.launcher.Launcher.launch(Launcher.java:238)
	at jenkins.maven3.agent.Maven32Main.launch(Maven32Main.java:186)
	at sun.reflect.NativeMethodAccessorImpl.invoke0(Native Method)
	at sun.reflect.NativeMethodAccessorImpl.invoke(NativeMethodAccessorImpl.java:57)
	at sun.reflect.DelegatingMethodAccessorImpl.invoke(DelegatingMethodAccessorImpl.java:43)
	at java.lang.reflect.Method.invoke(Method.java:606)
	at hudson.maven.Maven3Builder.call(Maven3Builder.java:136)
	at hudson.maven.Maven3Builder.call(Maven3Builder.java:71)
	at hudson.remoting.UserRequest.perform(UserRequest.java:121)
	at hudson.remoting.UserRequest.perform(UserRequest.java:49)
	at hudson.remoting.Request$2.run(Request.java:326)
	at hudson.remoting.InterceptingExecutorService$1.call(InterceptingExecutorService.java:68)
	at java.util.concurrent.FutureTask.run(FutureTask.java:262)
	at java.util.concurrent.ThreadPoolExecutor.runWorker(ThreadPoolExecutor.java:1145)
	at java.util.concurrent.ThreadPoolExecutor$Worker.run(ThreadPoolExecutor.java:615)
	at java.lang.Thread.run(Thread.java:745)
Caused by: org.xmlpull.v1.XmlPullParserException: unexpected type (position:END_DOCUMENT null@3:1
in java.io.InputStreamReader@2dc5fe9a) 
	at org.kxml2.io.KXmlParser.exception(Unknown Source)
	at org.kxml2.io.KXmlParser.nextTag(Unknown Source)
	at org.apache.felix.bundlerepository.impl.PullParser.parseRepository(PullParser.java:43)
	at org.apache.felix.bundlerepository.impl.DataModelHelperImpl.repository(DataModelHelperImpl.java:147)
	at org.apache.felix.bundlerepository.impl.DataModelHelperImpl.repository(DataModelHelperImpl.java:118)
	at org.apache.felix.obrplugin.ObrUpdate.parseRepositoryXml(ObrUpdate.java:316)
	... 33 more
[INFO]                                                                         
[INFO] ------------------------------------------------------------------------
[INFO] Building Apache HttpComponents Core Benchmarking Tool 5.0-alpha1-SNAPSHOT
[INFO] ------------------------------------------------------------------------
[INFO] 
[INFO] --- maven-clean-plugin:2.5:clean (default-clean) @ httpcore-ab ---
[INFO] Deleting <https://builds.apache.org/job/httpcomponents-core-5.x/ws/httpcore-trunk/httpcore-ab/target>
[INFO] 
[INFO] --- maven-checkstyle-plugin:2.9.1:checkstyle (validate) @ httpcore-ab ---
[INFO] Starting audit...
Audit done.

[INFO] 
[INFO] --- maven-checkstyle-plugin:2.9.1:checkstyle (validate-main) @ httpcore-ab ---
[INFO] Starting audit...
Audit done.

[INFO] 
[INFO] --- maven-checkstyle-plugin:2.9.1:checkstyle (validate-test) @ httpcore-ab ---
[INFO] Starting audit...
Audit done.

[INFO] 
[INFO] --- maven-checkstyle-plugin:2.9.1:checkstyle (validate-examples) @ httpcore-ab ---
[INFO] 
[INFO] --- maven-remote-resources-plugin:1.4:process (default) @ httpcore-ab ---
[INFO] 
[INFO] --- buildnumber-maven-plugin:1.2:create (default) @ httpcore-ab ---
[INFO] Checking for local modifications: skipped.
[INFO] Updating project files from SCM: skipped.
[INFO] Executing: /bin/sh -c cd <https://builds.apache.org/job/httpcomponents-core-5.x/ws/httpcore-trunk/httpcore-ab>
&& svn --non-interactive info
[INFO] Working directory: <https://builds.apache.org/job/httpcomponents-core-5.x/ws/httpcore-trunk/httpcore-ab>
[INFO] Storing buildNumber: 1717428 at timestamp: 1449018260114
[INFO] Executing: /bin/sh -c cd <https://builds.apache.org/job/httpcomponents-core-5.x/ws/httpcore-trunk/httpcore-ab>
&& svn --non-interactive info
[INFO] Working directory: <https://builds.apache.org/job/httpcomponents-core-5.x/ws/httpcore-trunk/httpcore-ab>
[INFO] Storing buildScmBranch: trunk
[INFO] 
[INFO] --- maven-resources-plugin:2.6:resources (default-resources) @ httpcore-ab ---
[INFO] Using 'UTF-8' encoding to copy filtered resources.
[INFO] skip non existing resourceDirectory <https://builds.apache.org/job/httpcomponents-core-5.x/ws/httpcore-trunk/httpcore-ab/src/main/resources>
[INFO] Copying 3 resources
[INFO] 
[INFO] --- maven-compiler-plugin:3.1:compile (default-compile) @ httpcore-ab ---
[INFO] Changes detected - recompiling the module!
[INFO] Compiling 12 source files to <https://builds.apache.org/job/httpcomponents-core-5.x/ws/httpcore-trunk/httpcore-ab/target/classes>
[INFO] -------------------------------------------------------------
[ERROR] COMPILATION ERROR : 
[INFO] -------------------------------------------------------------
[ERROR] <https://builds.apache.org/job/httpcomponents-core-5.x/ws/httpcore-trunk/httpcore-ab/src/main/java/org/apache/hc/core5/http/benchmark/BenchmarkConnection.java>:[33,40]
cannot find symbol
  symbol:   class DefaultBHttpClientConnection
  location: package org.apache.hc.core5.http.impl.io
[ERROR] <https://builds.apache.org/job/httpcomponents-core-5.x/ws/httpcore-trunk/httpcore-ab/src/main/java/org/apache/hc/core5/http/benchmark/BenchmarkConnection.java>:[37,35]
cannot find symbol
  symbol: class DefaultBHttpClientConnection
[ERROR] <https://builds.apache.org/job/httpcomponents-core-5.x/ws/httpcore-trunk/httpcore-ab/src/main/java/org/apache/hc/core5/http/benchmark/BenchmarkWorker.java>:[52,40]
cannot find symbol
  symbol:   class HttpRequestExecutor
  location: package org.apache.hc.core5.http.impl.io
[ERROR] <https://builds.apache.org/job/httpcomponents-core-5.x/ws/httpcore-trunk/httpcore-ab/src/main/java/org/apache/hc/core5/http/benchmark/BenchmarkWorker.java>:[70,19]
cannot find symbol
  symbol:   class HttpRequestExecutor
  location: class org.apache.hc.core5.http.benchmark.BenchmarkWorker
[ERROR] <https://builds.apache.org/job/httpcomponents-core-5.x/ws/httpcore-trunk/httpcore-ab/src/main/java/org/apache/hc/core5/http/benchmark/BenchmarkConnection.java>:[51,17]
cannot find symbol
  symbol:   variable super
  location: class org.apache.hc.core5.http.benchmark.BenchmarkConnection
[ERROR] <https://builds.apache.org/job/httpcomponents-core-5.x/ws/httpcore-trunk/httpcore-ab/src/main/java/org/apache/hc/core5/http/benchmark/BenchmarkConnection.java>:[46,5]
method does not override or implement a method from a supertype
[ERROR] <https://builds.apache.org/job/httpcomponents-core-5.x/ws/httpcore-trunk/httpcore-ab/src/main/java/org/apache/hc/core5/http/benchmark/BenchmarkConnection.java>:[57,40]
cannot find symbol
  symbol:   variable super
  location: class org.apache.hc.core5.http.benchmark.BenchmarkConnection
[ERROR] <https://builds.apache.org/job/httpcomponents-core-5.x/ws/httpcore-trunk/httpcore-ab/src/main/java/org/apache/hc/core5/http/benchmark/BenchmarkConnection.java>:[55,5]
method does not override or implement a method from a supertype
[ERROR] <https://builds.apache.org/job/httpcomponents-core-5.x/ws/httpcore-trunk/httpcore-ab/src/main/java/org/apache/hc/core5/http/benchmark/BenchmarkWorker.java>:[98,33]
cannot find symbol
  symbol:   class HttpRequestExecutor
  location: class org.apache.hc.core5.http.benchmark.BenchmarkWorker
[ERROR] <https://builds.apache.org/job/httpcomponents-core-5.x/ws/httpcore-trunk/httpcore-ab/src/main/java/org/apache/hc/core5/http/benchmark/BenchmarkWorker.java>:[129,26]
cannot find symbol
  symbol:   method isOpen()
  location: variable conn of type org.apache.hc.core5.http.benchmark.BenchmarkConnection
[ERROR] <https://builds.apache.org/job/httpcomponents-core-5.x/ws/httpcore-trunk/httpcore-ab/src/main/java/org/apache/hc/core5/http/benchmark/BenchmarkWorker.java>:[142,25]
cannot find symbol
  symbol:   method bind(java.net.Socket)
  location: variable conn of type org.apache.hc.core5.http.benchmark.BenchmarkConnection
[ERROR] <https://builds.apache.org/job/httpcomponents-core-5.x/ws/httpcore-trunk/httpcore-ab/src/main/java/org/apache/hc/core5/http/benchmark/BenchmarkWorker.java>:[158,25]
cannot find symbol
  symbol:   method shutdown()
  location: variable conn of type org.apache.hc.core5.http.benchmark.BenchmarkConnection
[ERROR] <https://builds.apache.org/job/httpcomponents-core-5.x/ws/httpcore-trunk/httpcore-ab/src/main/java/org/apache/hc/core5/http/benchmark/BenchmarkWorker.java>:[196,51]
cannot find symbol
  symbol:   method isConsistent()
  location: variable conn of type org.apache.hc.core5.http.benchmark.BenchmarkConnection
[ERROR] <https://builds.apache.org/job/httpcomponents-core-5.x/ws/httpcore-trunk/httpcore-ab/src/main/java/org/apache/hc/core5/http/benchmark/BenchmarkWorker.java>:[197,25]
cannot find symbol
  symbol:   method close()
  location: variable conn of type org.apache.hc.core5.http.benchmark.BenchmarkConnection
[ERROR] <https://builds.apache.org/job/httpcomponents-core-5.x/ws/httpcore-trunk/httpcore-ab/src/main/java/org/apache/hc/core5/http/benchmark/BenchmarkWorker.java>:[225,17]
cannot find symbol
  symbol:   method close()
  location: variable conn of type org.apache.hc.core5.http.benchmark.BenchmarkConnection
[INFO] 15 errors 
[INFO] -------------------------------------------------------------
[INFO] ------------------------------------------------------------------------
[INFO] Reactor Summary:
[INFO] 
[INFO] Apache HttpComponents Core Parent ................. SUCCESS [ 18.995 s]
[INFO] Apache HttpComponents Core ........................ SUCCESS [01:19 min]
[INFO] Apache HttpComponents Core OSGi bundle ............ SUCCESS [ 10.238 s]
[INFO] Apache HttpComponents Core Benchmarking Tool ...... FAILURE [  1.531 s]
[INFO] ------------------------------------------------------------------------
[INFO] BUILD FAILURE
[INFO] ------------------------------------------------------------------------
[INFO] Total time: 01:53 min
[INFO] Finished at: 2015-12-02T01:04:21+00:00
[INFO] Final Memory: 60M/274M
[INFO] ------------------------------------------------------------------------
[ERROR] Failed to execute goal org.apache.maven.plugins:maven-compiler-plugin:3.1:compile
(default-compile) on project httpcore-ab: Compilation failure: Compilation failure:
[ERROR] <https://builds.apache.org/job/httpcomponents-core-5.x/ws/httpcore-trunk/httpcore-ab/src/main/java/org/apache/hc/core5/http/benchmark/BenchmarkConnection.java>:[33,40]
cannot find symbol
[ERROR] symbol:   class DefaultBHttpClientConnection
[ERROR] location: package org.apache.hc.core5.http.impl.io
[ERROR] <https://builds.apache.org/job/httpcomponents-core-5.x/ws/httpcore-trunk/httpcore-ab/src/main/java/org/apache/hc/core5/http/benchmark/BenchmarkConnection.java>:[37,35]
cannot find symbol
[ERROR] symbol: class DefaultBHttpClientConnection
[ERROR] <https://builds.apache.org/job/httpcomponents-core-5.x/ws/httpcore-trunk/httpcore-ab/src/main/java/org/apache/hc/core5/http/benchmark/BenchmarkWorker.java>:[52,40]
cannot find symbol
[ERROR] symbol:   class HttpRequestExecutor
[ERROR] location: package org.apache.hc.core5.http.impl.io
[ERROR] <https://builds.apache.org/job/httpcomponents-core-5.x/ws/httpcore-trunk/httpcore-ab/src/main/java/org/apache/hc/core5/http/benchmark/BenchmarkWorker.java>:[70,19]
cannot find symbol
[ERROR] symbol:   class HttpRequestExecutor
[ERROR] location: class org.apache.hc.core5.http.benchmark.BenchmarkWorker
[ERROR] <https://builds.apache.org/job/httpcomponents-core-5.x/ws/httpcore-trunk/httpcore-ab/src/main/java/org/apache/hc/core5/http/benchmark/BenchmarkConnection.java>:[51,17]
cannot find symbol
[ERROR] symbol:   variable super
[ERROR] location: class org.apache.hc.core5.http.benchmark.BenchmarkConnection
[ERROR] <https://builds.apache.org/job/httpcomponents-core-5.x/ws/httpcore-trunk/httpcore-ab/src/main/java/org/apache/hc/core5/http/benchmark/BenchmarkConnection.java>:[46,5]
method does not override or implement a method from a supertype
[ERROR] <https://builds.apache.org/job/httpcomponents-core-5.x/ws/httpcore-trunk/httpcore-ab/src/main/java/org/apache/hc/core5/http/benchmark/BenchmarkConnection.java>:[57,40]
cannot find symbol
[ERROR] symbol:   variable super
[ERROR] location: class org.apache.hc.core5.http.benchmark.BenchmarkConnection
[ERROR] <https://builds.apache.org/job/httpcomponents-core-5.x/ws/httpcore-trunk/httpcore-ab/src/main/java/org/apache/hc/core5/http/benchmark/BenchmarkConnection.java>:[55,5]
method does not override or implement a method from a supertype
[ERROR] <https://builds.apache.org/job/httpcomponents-core-5.x/ws/httpcore-trunk/httpcore-ab/src/main/java/org/apache/hc/core5/http/benchmark/BenchmarkWorker.java>:[98,33]
cannot find symbol
[ERROR] symbol:   class HttpRequestExecutor
[ERROR] location: class org.apache.hc.core5.http.benchmark.BenchmarkWorker
[ERROR] <https://builds.apache.org/job/httpcomponents-core-5.x/ws/httpcore-trunk/httpcore-ab/src/main/java/org/apache/hc/core5/http/benchmark/BenchmarkWorker.java>:[129,26]
cannot find symbol
[ERROR] symbol:   method isOpen()
[ERROR] location: variable conn of type org.apache.hc.core5.http.benchmark.BenchmarkConnection
[ERROR] <https://builds.apache.org/job/httpcomponents-core-5.x/ws/httpcore-trunk/httpcore-ab/src/main/java/org/apache/hc/core5/http/benchmark/BenchmarkWorker.java>:[142,25]
cannot find symbol
[ERROR] symbol:   method bind(java.net.Socket)
[ERROR] location: variable conn of type org.apache.hc.core5.http.benchmark.BenchmarkConnection
[ERROR] <https://builds.apache.org/job/httpcomponents-core-5.x/ws/httpcore-trunk/httpcore-ab/src/main/java/org/apache/hc/core5/http/benchmark/BenchmarkWorker.java>:[158,25]
cannot find symbol
[ERROR] symbol:   method shutdown()
[ERROR] location: variable conn of type org.apache.hc.core5.http.benchmark.BenchmarkConnection
[ERROR] <https://builds.apache.org/job/httpcomponents-core-5.x/ws/httpcore-trunk/httpcore-ab/src/main/java/org/apache/hc/core5/http/benchmark/BenchmarkWorker.java>:[196,51]
cannot find symbol
[ERROR] symbol:   method isConsistent()
[ERROR] location: variable conn of type org.apache.hc.core5.http.benchmark.BenchmarkConnection
[ERROR] <https://builds.apache.org/job/httpcomponents-core-5.x/ws/httpcore-trunk/httpcore-ab/src/main/java/org/apache/hc/core5/http/benchmark/BenchmarkWorker.java>:[197,25]
cannot find symbol
[ERROR] symbol:   method close()
[ERROR] location: variable conn of type org.apache.hc.core5.http.benchmark.BenchmarkConnection
[ERROR] <https://builds.apache.org/job/httpcomponents-core-5.x/ws/httpcore-trunk/httpcore-ab/src/main/java/org/apache/hc/core5/http/benchmark/BenchmarkWorker.java>:[225,17]
cannot find symbol
[ERROR] symbol:   method close()
[ERROR] location: variable conn of type org.apache.hc.core5.http.benchmark.BenchmarkConnection
[ERROR] -> [Help 1]
[ERROR] 
[ERROR] To see the full stack trace of the errors, re-run Maven with the -e switch.
[ERROR] Re-run Maven using the -X switch to enable full debug logging.
[ERROR] 
[ERROR] For more information about the errors and possible solutions, please read the following
articles:
[ERROR] [Help 1] http://cwiki.apache.org/confluence/display/MAVEN/MojoFailureException
[ERROR] 
[ERROR] After correcting the problems, you can resume the build with the command
[ERROR]   mvn <goals> -rf :httpcore-ab
[JENKINS] Archiving <https://builds.apache.org/job/httpcomponents-core-5.x/ws/httpcore-trunk/httpcore-ab/pom.xml>
to org.apache.httpcomponents.core5/httpcore-ab/5.0-alpha1-SNAPSHOT/httpcore-ab-5.0-alpha1-SNAPSHOT.pom
No prior successful build to compare, so performing full copy of artifacts
[JENKINS] Archiving <https://builds.apache.org/job/httpcomponents-core-5.x/ws/httpcore-trunk/pom.xml>
to org.apache.httpcomponents.core5/httpcore-parent/5.0-alpha1-SNAPSHOT/httpcore-parent-5.0-alpha1-SNAPSHOT.pom
No prior successful build to compare, so performing full copy of artifacts
[JENKINS] Archiving <https://builds.apache.org/job/httpcomponents-core-5.x/ws/httpcore-trunk/httpcore-osgi/pom.xml>
to org.apache.httpcomponents.core5/httpcore-osgi/5.0-alpha1-SNAPSHOT/httpcore-osgi-5.0-alpha1-SNAPSHOT.pom
[JENKINS] Archiving <https://builds.apache.org/job/httpcomponents-core-5.x/ws/httpcore-trunk/httpcore-osgi/target/org.apache.httpcomponents.httpcore_5.0-alpha1-SNAPSHOT.jar>
to org.apache.httpcomponents.core5/httpcore-osgi/5.0-alpha1-SNAPSHOT/httpcore-osgi-5.0-alpha1-SNAPSHOT.jar
[JENKINS] Archiving <https://builds.apache.org/job/httpcomponents-core-5.x/ws/httpcore-trunk/httpcore-osgi/target/org.apache.httpcomponents.httpcore_5.0-alpha1-SNAPSHOT-sources.jar>
to org.apache.httpcomponents.core5/httpcore-osgi/5.0-alpha1-SNAPSHOT/httpcore-osgi-5.0-alpha1-SNAPSHOT-sources.jar
No prior successful build to compare, so performing full copy of artifacts
[JENKINS] Archiving <https://builds.apache.org/job/httpcomponents-core-5.x/ws/httpcore-trunk/httpcore/pom.xml>
to org.apache.httpcomponents.core5/httpcore/5.0-alpha1-SNAPSHOT/httpcore-5.0-alpha1-SNAPSHOT.pom
[JENKINS] Archiving <https://builds.apache.org/job/httpcomponents-core-5.x/ws/httpcore-trunk/httpcore/target/httpcore-5.0-alpha1-SNAPSHOT.jar>
to org.apache.httpcomponents.core5/httpcore/5.0-alpha1-SNAPSHOT/httpcore-5.0-alpha1-SNAPSHOT.jar
[JENKINS] Archiving <https://builds.apache.org/job/httpcomponents-core-5.x/ws/httpcore-trunk/httpcore/target/httpcore-5.0-alpha1-SNAPSHOT-sources.jar>
to org.apache.httpcomponents.core5/httpcore/5.0-alpha1-SNAPSHOT/httpcore-5.0-alpha1-SNAPSHOT-sources.jar
[JENKINS] Archiving <https://builds.apache.org/job/httpcomponents-core-5.x/ws/httpcore-trunk/httpcore/target/httpcore-5.0-alpha1-SNAPSHOT-javadoc.jar>
to org.apache.httpcomponents.core5/httpcore/5.0-alpha1-SNAPSHOT/httpcore-5.0-alpha1-SNAPSHOT-javadoc.jar
[JENKINS] Archiving <https://builds.apache.org/job/httpcomponents-core-5.x/ws/httpcore-trunk/httpcore/target/httpcore-5.0-alpha1-SNAPSHOT-tests.jar>
to org.apache.httpcomponents.core5/httpcore/5.0-alpha1-SNAPSHOT/httpcore-5.0-alpha1-SNAPSHOT-tests.jar
No prior successful build to compare, so performing full copy of artifacts
Sending e-mails to: commits@hc.apache.org
channel stopped

Mime
View raw message