hc-commits mailing list archives

Site index · List index
Message view « Date » · « Thread »
Top « Date » · « Thread »
From Apache Jenkins Server <jenk...@builds.apache.org>
Subject Build failed in Jenkins: httpcomponents-core-5.x » Apache HttpComponents Core OSGi bundle #73
Date Fri, 11 Dec 2015 01:06:19 GMT
See <https://builds.apache.org/job/httpcomponents-core-5.x/org.apache.httpcomponents.core5$httpcore5-osgi/73/>

------------------------------------------
[...truncated 67 lines...]
[INFO] Downloaded: http://repo.maven.apache.org/maven2/org/ops4j/pax/url/pax-url-classpath/2.0.0/pax-url-classpath-2.0.0.pom
(3 KB at 35.6 KB/sec)
[INFO] Downloading: http://repo.maven.apache.org/maven2/org/ops4j/pax/swissbox/pax-swissbox-optional-jcl/1.7.0/pax-swissbox-optional-jcl-1.7.0.pom
[INFO] Downloaded: http://repo.maven.apache.org/maven2/org/ops4j/pax/swissbox/pax-swissbox-optional-jcl/1.7.0/pax-swissbox-optional-jcl-1.7.0.pom
(2 KB at 16.6 KB/sec)
[INFO] Downloading: http://repo.maven.apache.org/maven2/org/ops4j/pax/exam/pax-exam-junit4/3.5.0/pax-exam-junit4-3.5.0.pom
[INFO] Downloaded: http://repo.maven.apache.org/maven2/org/ops4j/pax/exam/pax-exam-junit4/3.5.0/pax-exam-junit4-3.5.0.pom
(2 KB at 21.5 KB/sec)
[INFO] Downloading: http://repo.maven.apache.org/maven2/org/ops4j/pax/exam/pax-exam-link-mvn/3.5.0/pax-exam-link-mvn-3.5.0.pom
[INFO] Downloaded: http://repo.maven.apache.org/maven2/org/ops4j/pax/exam/pax-exam-link-mvn/3.5.0/pax-exam-link-mvn-3.5.0.pom
(2 KB at 18.8 KB/sec)
[INFO] Downloading: http://repo.maven.apache.org/maven2/org/ops4j/pax/url/pax-url-aether/2.0.0/pax-url-aether-2.0.0.pom
[INFO] Downloaded: http://repo.maven.apache.org/maven2/org/ops4j/pax/url/pax-url-aether/2.0.0/pax-url-aether-2.0.0.pom
(11 KB at 157.9 KB/sec)
[INFO] Downloading: http://repo.maven.apache.org/maven2/org/eclipse/aether/aether-api/0.9.0.M4/aether-api-0.9.0.M4.pom
[INFO] Downloaded: http://repo.maven.apache.org/maven2/org/eclipse/aether/aether-api/0.9.0.M4/aether-api-0.9.0.M4.pom
(2 KB at 27.5 KB/sec)
[INFO] Downloading: http://repo.maven.apache.org/maven2/org/eclipse/aether/aether/0.9.0.M4/aether-0.9.0.M4.pom
[INFO] Downloaded: http://repo.maven.apache.org/maven2/org/eclipse/aether/aether/0.9.0.M4/aether-0.9.0.M4.pom
(29 KB at 420.6 KB/sec)
[INFO] Downloading: http://repo.maven.apache.org/maven2/org/eclipse/aether/aether-spi/0.9.0.M4/aether-spi-0.9.0.M4.pom
[INFO] Downloaded: http://repo.maven.apache.org/maven2/org/eclipse/aether/aether-spi/0.9.0.M4/aether-spi-0.9.0.M4.pom
(2 KB at 30.3 KB/sec)
[INFO] Downloading: http://repo.maven.apache.org/maven2/org/eclipse/aether/aether-util/0.9.0.M4/aether-util-0.9.0.M4.pom
[INFO] Downloaded: http://repo.maven.apache.org/maven2/org/eclipse/aether/aether-util/0.9.0.M4/aether-util-0.9.0.M4.pom
(3 KB at 31.4 KB/sec)
[INFO] Downloading: http://repo.maven.apache.org/maven2/org/eclipse/aether/aether-impl/0.9.0.M4/aether-impl-0.9.0.M4.pom
[INFO] Downloaded: http://repo.maven.apache.org/maven2/org/eclipse/aether/aether-impl/0.9.0.M4/aether-impl-0.9.0.M4.pom
(4 KB at 48.5 KB/sec)
[INFO] Downloading: http://repo.maven.apache.org/maven2/org/eclipse/aether/aether-connector-basic/0.9.0.M4/aether-connector-basic-0.9.0.M4.pom
[INFO] Downloaded: http://repo.maven.apache.org/maven2/org/eclipse/aether/aether-connector-basic/0.9.0.M4/aether-connector-basic-0.9.0.M4.pom
(4 KB at 45.5 KB/sec)
[INFO] Downloading: http://repo.maven.apache.org/maven2/org/eclipse/aether/aether-transport-wagon/0.9.0.M4/aether-transport-wagon-0.9.0.M4.pom
[INFO] Downloaded: http://repo.maven.apache.org/maven2/org/eclipse/aether/aether-transport-wagon/0.9.0.M4/aether-transport-wagon-0.9.0.M4.pom
(4 KB at 54.6 KB/sec)
[INFO] Downloading: http://repo.maven.apache.org/maven2/org/apache/maven/maven-aether-provider/3.1.1/maven-aether-provider-3.1.1.pom
[INFO] Downloaded: http://repo.maven.apache.org/maven2/org/apache/maven/maven-aether-provider/3.1.1/maven-aether-provider-3.1.1.pom
(4 KB at 60.6 KB/sec)
[INFO] Downloading: http://repo.maven.apache.org/maven2/org/apache/maven/maven/3.1.1/maven-3.1.1.pom
[INFO] Downloaded: http://repo.maven.apache.org/maven2/org/apache/maven/maven/3.1.1/maven-3.1.1.pom
(22 KB at 322.0 KB/sec)
[INFO] Downloading: http://repo.maven.apache.org/maven2/org/apache/maven/maven-model/3.1.1/maven-model-3.1.1.pom
[INFO] Downloaded: http://repo.maven.apache.org/maven2/org/apache/maven/maven-model/3.1.1/maven-model-3.1.1.pom
(5 KB at 41.3 KB/sec)
[INFO] Downloading: http://repo.maven.apache.org/maven2/org/codehaus/plexus/plexus-utils/3.0.15/plexus-utils-3.0.15.pom
[INFO] Downloaded: http://repo.maven.apache.org/maven2/org/codehaus/plexus/plexus-utils/3.0.15/plexus-utils-3.0.15.pom
(4 KB at 46.5 KB/sec)
[INFO] Downloading: http://repo.maven.apache.org/maven2/org/apache/maven/maven-model-builder/3.1.1/maven-model-builder-3.1.1.pom
[INFO] Downloaded: http://repo.maven.apache.org/maven2/org/apache/maven/maven-model-builder/3.1.1/maven-model-builder-3.1.1.pom
(3 KB at 40.9 KB/sec)
[INFO] Downloading: http://repo.maven.apache.org/maven2/org/codehaus/plexus/plexus-interpolation/1.19/plexus-interpolation-1.19.pom
[INFO] Downloaded: http://repo.maven.apache.org/maven2/org/codehaus/plexus/plexus-interpolation/1.19/plexus-interpolation-1.19.pom
(2 KB at 12.0 KB/sec)
[INFO] Downloading: http://repo.maven.apache.org/maven2/org/apache/maven/maven-repository-metadata/3.1.1/maven-repository-metadata-3.1.1.pom
[INFO] Downloaded: http://repo.maven.apache.org/maven2/org/apache/maven/maven-repository-metadata/3.1.1/maven-repository-metadata-3.1.1.pom
(3 KB at 33.0 KB/sec)
[INFO] Downloading: http://repo.maven.apache.org/maven2/org/eclipse/aether/aether-api/0.9.0.M2/aether-api-0.9.0.M2.pom
[INFO] Downloaded: http://repo.maven.apache.org/maven2/org/eclipse/aether/aether-api/0.9.0.M2/aether-api-0.9.0.M2.pom
(2 KB at 25.7 KB/sec)
[INFO] Downloading: http://repo.maven.apache.org/maven2/org/eclipse/aether/aether-spi/0.9.0.M2/aether-spi-0.9.0.M2.pom
[INFO] Downloaded: http://repo.maven.apache.org/maven2/org/eclipse/aether/aether-spi/0.9.0.M2/aether-spi-0.9.0.M2.pom
(2 KB at 26.0 KB/sec)
[INFO] Downloading: http://repo.maven.apache.org/maven2/org/eclipse/aether/aether-impl/0.9.0.M2/aether-impl-0.9.0.M2.pom
[INFO] Downloaded: http://repo.maven.apache.org/maven2/org/eclipse/aether/aether-impl/0.9.0.M2/aether-impl-0.9.0.M2.pom
(4 KB at 49.5 KB/sec)
[INFO] Downloading: http://repo.maven.apache.org/maven2/org/apache/maven/maven-settings-builder/3.1.1/maven-settings-builder-3.1.1.pom
[INFO] Downloaded: http://repo.maven.apache.org/maven2/org/apache/maven/maven-settings-builder/3.1.1/maven-settings-builder-3.1.1.pom
(3 KB at 38.4 KB/sec)
[INFO] Downloading: http://repo.maven.apache.org/maven2/org/apache/maven/maven-settings/3.1.1/maven-settings-3.1.1.pom
[INFO] Downloaded: http://repo.maven.apache.org/maven2/org/apache/maven/maven-settings/3.1.1/maven-settings-3.1.1.pom
(3 KB at 32.1 KB/sec)
[INFO] Downloading: http://repo.maven.apache.org/maven2/org/sonatype/plexus/plexus-sec-dispatcher/1.4/plexus-sec-dispatcher-1.4.pom
[INFO] Downloaded: http://repo.maven.apache.org/maven2/org/sonatype/plexus/plexus-sec-dispatcher/1.4/plexus-sec-dispatcher-1.4.pom
(3 KB at 43.8 KB/sec)
[INFO] Downloading: http://repo.maven.apache.org/maven2/org/sonatype/plexus/plexus-cipher/1.7/plexus-cipher-1.7.pom
[INFO] Downloaded: http://repo.maven.apache.org/maven2/org/sonatype/plexus/plexus-cipher/1.7/plexus-cipher-1.7.pom
(5 KB at 61.8 KB/sec)
[INFO] Downloading: http://repo.maven.apache.org/maven2/org/sonatype/spice/spice-parent/15/spice-parent-15.pom
[INFO] Downloaded: http://repo.maven.apache.org/maven2/org/sonatype/spice/spice-parent/15/spice-parent-15.pom
(9 KB at 123.7 KB/sec)
[INFO] Downloading: http://repo.maven.apache.org/maven2/org/apache/maven/wagon/wagon-provider-api/2.5/wagon-provider-api-2.5.pom
[INFO] Downloaded: http://repo.maven.apache.org/maven2/org/apache/maven/wagon/wagon-provider-api/2.5/wagon-provider-api-2.5.pom
(2 KB at 25.5 KB/sec)
[INFO] Downloading: http://repo.maven.apache.org/maven2/org/apache/maven/wagon/wagon/2.5/wagon-2.5.pom
[INFO] Downloaded: http://repo.maven.apache.org/maven2/org/apache/maven/wagon/wagon/2.5/wagon-2.5.pom
(20 KB at 287.9 KB/sec)
[INFO] Downloading: http://repo.maven.apache.org/maven2/org/apache/maven/wagon/wagon-file/2.5/wagon-file-2.5.pom
[INFO] Downloaded: http://repo.maven.apache.org/maven2/org/apache/maven/wagon/wagon-file/2.5/wagon-file-2.5.pom
(2 KB at 23.0 KB/sec)
[INFO] Downloading: http://repo.maven.apache.org/maven2/org/apache/maven/wagon/wagon-providers/2.5/wagon-providers-2.5.pom
[INFO] Downloaded: http://repo.maven.apache.org/maven2/org/apache/maven/wagon/wagon-providers/2.5/wagon-providers-2.5.pom
(3 KB at 40.3 KB/sec)
[INFO] Downloading: http://repo.maven.apache.org/maven2/org/apache/maven/wagon/wagon-http-lightweight/2.5/wagon-http-lightweight-2.5.pom
[INFO] Downloaded: http://repo.maven.apache.org/maven2/org/apache/maven/wagon/wagon-http-lightweight/2.5/wagon-http-lightweight-2.5.pom
(2 KB at 28.5 KB/sec)
[INFO] Downloading: http://repo.maven.apache.org/maven2/org/apache/maven/wagon/wagon-http-shared/2.5/wagon-http-shared-2.5.pom
[INFO] Downloaded: http://repo.maven.apache.org/maven2/org/apache/maven/wagon/wagon-http-shared/2.5/wagon-http-shared-2.5.pom
(2 KB at 27.0 KB/sec)
[INFO] Downloading: http://repo.maven.apache.org/maven2/org/ops4j/pax/url/pax-url-wrap/2.0.0/pax-url-wrap-2.0.0.pom
[INFO] Downloaded: http://repo.maven.apache.org/maven2/org/ops4j/pax/url/pax-url-wrap/2.0.0/pax-url-wrap-2.0.0.pom
(3 KB at 40.2 KB/sec)
[INFO] Downloading: http://repo.maven.apache.org/maven2/org/ops4j/pax/swissbox/pax-swissbox-bnd/1.7.0/pax-swissbox-bnd-1.7.0.pom
[INFO] Downloaded: http://repo.maven.apache.org/maven2/org/ops4j/pax/swissbox/pax-swissbox-bnd/1.7.0/pax-swissbox-bnd-1.7.0.pom
(3 KB at 30.1 KB/sec)
[INFO] Downloading: http://repo.maven.apache.org/maven2/org/slf4j/slf4j-api/1.6.4/slf4j-api-1.6.4.pom
[INFO] Downloaded: http://repo.maven.apache.org/maven2/org/slf4j/slf4j-api/1.6.4/slf4j-api-1.6.4.pom
(3 KB at 39.2 KB/sec)
[INFO] Downloading: http://repo.maven.apache.org/maven2/org/slf4j/slf4j-parent/1.6.4/slf4j-parent-1.6.4.pom
[INFO] Downloaded: http://repo.maven.apache.org/maven2/org/slf4j/slf4j-parent/1.6.4/slf4j-parent-1.6.4.pom
(12 KB at 180.6 KB/sec)
[INFO] Downloading: http://repo.maven.apache.org/maven2/ch/qos/logback/logback-classic/1.0.1/logback-classic-1.0.1.pom
[INFO] Downloaded: http://repo.maven.apache.org/maven2/ch/qos/logback/logback-classic/1.0.1/logback-classic-1.0.1.pom
(13 KB at 189.9 KB/sec)
[INFO] Downloading: http://repo.maven.apache.org/maven2/ch/qos/logback/logback-parent/1.0.1/logback-parent-1.0.1.pom
[INFO] Downloaded: http://repo.maven.apache.org/maven2/ch/qos/logback/logback-parent/1.0.1/logback-parent-1.0.1.pom
(14 KB at 201.8 KB/sec)
[INFO] Downloading: http://repo.maven.apache.org/maven2/ch/qos/logback/logback-core/1.0.1/logback-core-1.0.1.pom
[INFO] Downloaded: http://repo.maven.apache.org/maven2/ch/qos/logback/logback-core/1.0.1/logback-core-1.0.1.pom
(6 KB at 83.1 KB/sec)
[INFO] Downloading: http://repo.maven.apache.org/maven2/org/apache/felix/org.apache.felix.framework/4.2.0/org.apache.felix.framework-4.2.0.pom
[INFO] Downloaded: http://repo.maven.apache.org/maven2/org/apache/felix/org.apache.felix.framework/4.2.0/org.apache.felix.framework-4.2.0.pom
(4 KB at 59.4 KB/sec)
[INFO] Downloading: http://repository.apache.org/snapshots/org/apache/httpcomponents/httpcore/5.0-alpha1-SNAPSHOT/httpcore-5.0-alpha1-20150827.185500-6.jar
[INFO] Downloading: http://repository.apache.org/snapshots/org/apache/httpcomponents/httpcore/5.0-alpha1-SNAPSHOT/httpcore-5.0-alpha1-20150827.185500-6-tests.jar
[INFO] Downloaded: http://repository.apache.org/snapshots/org/apache/httpcomponents/httpcore/5.0-alpha1-SNAPSHOT/httpcore-5.0-alpha1-20150827.185500-6-tests.jar
(249 KB at 1054.8 KB/sec)
[INFO] Downloaded: http://repository.apache.org/snapshots/org/apache/httpcomponents/httpcore/5.0-alpha1-SNAPSHOT/httpcore-5.0-alpha1-20150827.185500-6.jar
(252 KB at 857.5 KB/sec)
[INFO] Downloading: http://repo.maven.apache.org/maven2/org/ops4j/pax/exam/pax-exam-container-native/3.5.0/pax-exam-container-native-3.5.0.jar
[INFO] Downloading: http://repo.maven.apache.org/maven2/org/ops4j/pax/exam/pax-exam/3.5.0/pax-exam-3.5.0.jar
[INFO] Downloading: http://repo.maven.apache.org/maven2/org/ops4j/base/ops4j-base-store/1.4.0/ops4j-base-store-1.4.0.jar
[INFO] Downloading: http://repo.maven.apache.org/maven2/org/ops4j/base/ops4j-base-io/1.4.0/ops4j-base-io-1.4.0.jar
[INFO] Downloading: http://repo.maven.apache.org/maven2/org/ops4j/base/ops4j-base-util-property/1.4.0/ops4j-base-util-property-1.4.0.jar
[INFO] Downloaded: http://repo.maven.apache.org/maven2/org/ops4j/base/ops4j-base-util-property/1.4.0/ops4j-base-util-property-1.4.0.jar
(6 KB at 87.7 KB/sec)
[INFO] Downloading: http://repo.maven.apache.org/maven2/org/ops4j/pax/exam/pax-exam-spi/3.5.0/pax-exam-spi-3.5.0.jar
[INFO] Downloaded: http://repo.maven.apache.org/maven2/org/ops4j/pax/exam/pax-exam-container-native/3.5.0/pax-exam-container-native-3.5.0.jar
(20 KB at 261.3 KB/sec)
[INFO] Downloading: http://repo.maven.apache.org/maven2/org/ops4j/base/ops4j-base-spi/1.4.0/ops4j-base-spi-1.4.0.jar
[INFO] Downloaded: http://repo.maven.apache.org/maven2/org/ops4j/base/ops4j-base-store/1.4.0/ops4j-base-store-1.4.0.jar
(8 KB at 95.7 KB/sec)
[INFO] Downloading: http://repo.maven.apache.org/maven2/org/ops4j/pax/tinybundles/tinybundles/2.0.0/tinybundles-2.0.0.jar
[INFO] Downloaded: http://repo.maven.apache.org/maven2/org/ops4j/base/ops4j-base-io/1.4.0/ops4j-base-io-1.4.0.jar
(20 KB at 208.1 KB/sec)
[INFO] Downloading: http://repo.maven.apache.org/maven2/org/ops4j/pax/swissbox/pax-swissbox-core/1.7.0/pax-swissbox-core-1.7.0.jar
[INFO] Downloaded: http://repo.maven.apache.org/maven2/org/ops4j/pax/exam/pax-exam/3.5.0/pax-exam-3.5.0.jar
(78 KB at 633.8 KB/sec)
[INFO] Downloading: http://repo.maven.apache.org/maven2/org/ops4j/pax/swissbox/pax-swissbox-lifecycle/1.7.0/pax-swissbox-lifecycle-1.7.0.jar
[INFO] Downloaded: http://repo.maven.apache.org/maven2/org/ops4j/pax/exam/pax-exam-spi/3.5.0/pax-exam-spi-3.5.0.jar
(67 KB at 1007.8 KB/sec)
[INFO] Downloading: http://repo.maven.apache.org/maven2/org/ops4j/pax/swissbox/pax-swissbox-tracker/1.7.0/pax-swissbox-tracker-1.7.0.jar
[INFO] Downloaded: http://repo.maven.apache.org/maven2/org/ops4j/base/ops4j-base-spi/1.4.0/ops4j-base-spi-1.4.0.jar
(7 KB at 87.1 KB/sec)
[INFO] Downloading: http://repo.maven.apache.org/maven2/org/ops4j/base/ops4j-base-lang/1.4.0/ops4j-base-lang-1.4.0.jar
[INFO] Downloaded: http://repo.maven.apache.org/maven2/org/ops4j/pax/swissbox/pax-swissbox-core/1.7.0/pax-swissbox-core-1.7.0.jar
(9 KB at 141.2 KB/sec)
[INFO] Downloading: http://repo.maven.apache.org/maven2/org/ops4j/base/ops4j-base-net/1.4.0/ops4j-base-net-1.4.0.jar
[INFO] Downloaded: http://repo.maven.apache.org/maven2/org/ops4j/pax/tinybundles/tinybundles/2.0.0/tinybundles-2.0.0.jar
(29 KB at 285.3 KB/sec)
[INFO] Downloading: http://repo.maven.apache.org/maven2/org/ops4j/base/ops4j-base-monitors/1.4.0/ops4j-base-monitors-1.4.0.jar
[INFO] Downloaded: http://repo.maven.apache.org/maven2/org/ops4j/pax/swissbox/pax-swissbox-lifecycle/1.7.0/pax-swissbox-lifecycle-1.7.0.jar
(7 KB at 95.8 KB/sec)
[INFO] Downloading: http://repo.maven.apache.org/maven2/org/ops4j/pax/url/pax-url-link/2.0.0/pax-url-link-2.0.0.jar
[INFO] Downloaded: http://repo.maven.apache.org/maven2/org/ops4j/pax/swissbox/pax-swissbox-tracker/1.7.0/pax-swissbox-tracker-1.7.0.jar
(15 KB at 224.4 KB/sec)
[INFO] Downloading: http://repo.maven.apache.org/maven2/org/ops4j/pax/url/pax-url-classpath/2.0.0/pax-url-classpath-2.0.0.jar
[INFO] Downloaded: http://repo.maven.apache.org/maven2/org/ops4j/base/ops4j-base-lang/1.4.0/ops4j-base-lang-1.4.0.jar
(7 KB at 92.4 KB/sec)
[INFO] Downloading: http://repo.maven.apache.org/maven2/org/ops4j/pax/swissbox/pax-swissbox-optional-jcl/1.7.0/pax-swissbox-optional-jcl-1.7.0.jar
[INFO] Downloaded: http://repo.maven.apache.org/maven2/org/ops4j/base/ops4j-base-net/1.4.0/ops4j-base-net-1.4.0.jar
(12 KB at 150.5 KB/sec)
[INFO] Downloading: http://repo.maven.apache.org/maven2/org/ops4j/pax/exam/pax-exam-junit4/3.5.0/pax-exam-junit4-3.5.0.jar
[INFO] Downloaded: http://repo.maven.apache.org/maven2/org/ops4j/base/ops4j-base-monitors/1.4.0/ops4j-base-monitors-1.4.0.jar
(8 KB at 119.8 KB/sec)
[INFO] Downloading: http://repo.maven.apache.org/maven2/org/ops4j/pax/exam/pax-exam-link-mvn/3.5.0/pax-exam-link-mvn-3.5.0.jar
[INFO] Downloaded: http://repo.maven.apache.org/maven2/org/ops4j/pax/url/pax-url-link/2.0.0/pax-url-link-2.0.0.jar
(8 KB at 112.4 KB/sec)
[INFO] Downloading: http://repo.maven.apache.org/maven2/org/ops4j/pax/url/pax-url-aether/2.0.0/pax-url-aether-2.0.0.jar
[INFO] Downloaded: http://repo.maven.apache.org/maven2/org/ops4j/pax/url/pax-url-classpath/2.0.0/pax-url-classpath-2.0.0.jar
(9 KB at 123.1 KB/sec)
[INFO] Downloading: http://repo.maven.apache.org/maven2/org/ops4j/pax/url/pax-url-commons/2.0.0/pax-url-commons-2.0.0.jar
[INFO] Downloaded: http://repo.maven.apache.org/maven2/org/ops4j/pax/swissbox/pax-swissbox-optional-jcl/1.7.0/pax-swissbox-optional-jcl-1.7.0.jar
(7 KB at 100.4 KB/sec)
[INFO] Downloading: http://repo.maven.apache.org/maven2/org/ops4j/pax/swissbox/pax-swissbox-property/1.7.0/pax-swissbox-property-1.7.0.jar
[INFO] Downloaded: http://repo.maven.apache.org/maven2/org/ops4j/pax/exam/pax-exam-link-mvn/3.5.0/pax-exam-link-mvn-3.5.0.jar
(12 KB at 154.0 KB/sec)
[INFO] Downloading: http://repo.maven.apache.org/maven2/org/eclipse/aether/aether-api/0.9.0.M4/aether-api-0.9.0.M4.jar
[INFO] Downloaded: http://repo.maven.apache.org/maven2/org/ops4j/pax/exam/pax-exam-junit4/3.5.0/pax-exam-junit4-3.5.0.jar
(38 KB at 398.8 KB/sec)
[INFO] Downloading: http://repo.maven.apache.org/maven2/org/eclipse/aether/aether-spi/0.9.0.M4/aether-spi-0.9.0.M4.jar
[INFO] Downloaded: http://repo.maven.apache.org/maven2/org/ops4j/pax/url/pax-url-commons/2.0.0/pax-url-commons-2.0.0.jar
(9 KB at 136.1 KB/sec)
[INFO] Downloading: http://repo.maven.apache.org/maven2/org/eclipse/aether/aether-util/0.9.0.M4/aether-util-0.9.0.M4.jar
[INFO] Downloaded: http://repo.maven.apache.org/maven2/org/ops4j/pax/swissbox/pax-swissbox-property/1.7.0/pax-swissbox-property-1.7.0.jar
(4 KB at 60.3 KB/sec)
[INFO] Downloading: http://repo.maven.apache.org/maven2/org/eclipse/aether/aether-impl/0.9.0.M4/aether-impl-0.9.0.M4.jar
[INFO] Downloaded: http://repo.maven.apache.org/maven2/org/eclipse/aether/aether-spi/0.9.0.M4/aether-spi-0.9.0.M4.jar
(32 KB at 485.4 KB/sec)
[INFO] Downloading: http://repo.maven.apache.org/maven2/org/eclipse/aether/aether-connector-basic/0.9.0.M4/aether-connector-basic-0.9.0.M4.jar
[INFO] Downloaded: http://repo.maven.apache.org/maven2/org/eclipse/aether/aether-util/0.9.0.M4/aether-util-0.9.0.M4.jar
(143 KB at 2125.6 KB/sec)
[INFO] Downloading: http://repo.maven.apache.org/maven2/org/eclipse/aether/aether-transport-wagon/0.9.0.M4/aether-transport-wagon-0.9.0.M4.jar
[INFO] Downloaded: http://repo.maven.apache.org/maven2/org/eclipse/aether/aether-impl/0.9.0.M4/aether-impl-0.9.0.M4.jar
(171 KB at 1554.3 KB/sec)
[INFO] Downloading: http://repo.maven.apache.org/maven2/org/apache/maven/maven-aether-provider/3.1.1/maven-aether-provider-3.1.1.jar
[INFO] Downloaded: http://repo.maven.apache.org/maven2/org/eclipse/aether/aether-transport-wagon/0.9.0.M4/aether-transport-wagon-0.9.0.M4.jar
(25 KB at 380.1 KB/sec)
[INFO] Downloading: http://repo.maven.apache.org/maven2/org/apache/maven/maven-model/3.1.1/maven-model-3.1.1.jar
[INFO] Downloaded: http://repo.maven.apache.org/maven2/org/eclipse/aether/aether-api/0.9.0.M4/aether-api-0.9.0.M4.jar
(134 KB at 801.6 KB/sec)
[INFO] Downloading: http://repo.maven.apache.org/maven2/org/apache/maven/maven-model-builder/3.1.1/maven-model-builder-3.1.1.jar
[INFO] Downloaded: http://repo.maven.apache.org/maven2/org/eclipse/aether/aether-connector-basic/0.9.0.M4/aether-connector-basic-0.9.0.M4.jar
(37 KB at 402.4 KB/sec)
[INFO] Downloading: http://repo.maven.apache.org/maven2/org/apache/maven/maven-repository-metadata/3.1.1/maven-repository-metadata-3.1.1.jar
[INFO] Downloaded: http://repo.maven.apache.org/maven2/org/apache/maven/maven-aether-provider/3.1.1/maven-aether-provider-3.1.1.jar
(59 KB at 868.6 KB/sec)
[INFO] Downloading: http://repo.maven.apache.org/maven2/org/codehaus/plexus/plexus-utils/3.0.15/plexus-utils-3.0.15.jar
[INFO] Downloaded: http://repo.maven.apache.org/maven2/org/apache/maven/maven-model/3.1.1/maven-model-3.1.1.jar
(151 KB at 2247.9 KB/sec)
[INFO] Downloading: http://repo.maven.apache.org/maven2/org/apache/maven/maven-settings-builder/3.1.1/maven-settings-builder-3.1.1.jar
[INFO] Downloaded: http://repo.maven.apache.org/maven2/org/apache/maven/maven-repository-metadata/3.1.1/maven-repository-metadata-3.1.1.jar
(25 KB at 378.3 KB/sec)
[INFO] Downloading: http://repo.maven.apache.org/maven2/org/codehaus/plexus/plexus-interpolation/1.19/plexus-interpolation-1.19.jar
[INFO] Downloaded: http://repo.maven.apache.org/maven2/org/apache/maven/maven-model-builder/3.1.1/maven-model-builder-3.1.1.jar
(156 KB at 1456.4 KB/sec)
[INFO] Downloading: http://repo.maven.apache.org/maven2/org/apache/maven/maven-settings/3.1.1/maven-settings-3.1.1.jar
[INFO] Downloaded: http://repo.maven.apache.org/maven2/org/apache/maven/maven-settings-builder/3.1.1/maven-settings-builder-3.1.1.jar
(41 KB at 634.1 KB/sec)
[INFO] Downloading: http://repo.maven.apache.org/maven2/org/sonatype/plexus/plexus-sec-dispatcher/1.4/plexus-sec-dispatcher-1.4.jar
[INFO] Downloaded: http://repo.maven.apache.org/maven2/org/codehaus/plexus/plexus-utils/3.0.15/plexus-utils-3.0.15.jar
(234 KB at 2287.8 KB/sec)
[INFO] Downloading: http://repo.maven.apache.org/maven2/org/sonatype/plexus/plexus-cipher/1.7/plexus-cipher-1.7.jar
[INFO] Downloaded: http://repo.maven.apache.org/maven2/org/codehaus/plexus/plexus-interpolation/1.19/plexus-interpolation-1.19.jar
(61 KB at 669.5 KB/sec)
[INFO] Downloading: http://repo.maven.apache.org/maven2/org/apache/maven/wagon/wagon-provider-api/2.5/wagon-provider-api-2.5.jar
[INFO] Downloaded: http://repo.maven.apache.org/maven2/org/ops4j/pax/url/pax-url-aether/2.0.0/pax-url-aether-2.0.0.jar
(1682 KB at 4288.8 KB/sec)
[INFO] Downloading: http://repo.maven.apache.org/maven2/org/apache/maven/wagon/wagon-file/2.5/wagon-file-2.5.jar
[INFO] Downloaded: http://repo.maven.apache.org/maven2/org/apache/maven/maven-settings/3.1.1/maven-settings-3.1.1.jar
(41 KB at 627.4 KB/sec)
[INFO] Downloading: http://repo.maven.apache.org/maven2/org/apache/maven/wagon/wagon-http-lightweight/2.5/wagon-http-lightweight-2.5.jar
[INFO] Downloaded: http://repo.maven.apache.org/maven2/org/sonatype/plexus/plexus-sec-dispatcher/1.4/plexus-sec-dispatcher-1.4.jar
(28 KB at 422.7 KB/sec)
[INFO] Downloading: http://repo.maven.apache.org/maven2/org/apache/maven/wagon/wagon-http-shared/2.5/wagon-http-shared-2.5.jar
[INFO] Downloaded: http://repo.maven.apache.org/maven2/org/sonatype/plexus/plexus-cipher/1.7/plexus-cipher-1.7.jar
(14 KB at 203.7 KB/sec)
[INFO] Downloading: http://repo.maven.apache.org/maven2/org/ops4j/pax/url/pax-url-wrap/2.0.0/pax-url-wrap-2.0.0.jar
[INFO] Downloaded: http://repo.maven.apache.org/maven2/org/apache/maven/wagon/wagon-provider-api/2.5/wagon-provider-api-2.5.jar
(52 KB at 724.4 KB/sec)
[INFO] Downloading: http://repo.maven.apache.org/maven2/org/ops4j/pax/swissbox/pax-swissbox-bnd/1.7.0/pax-swissbox-bnd-1.7.0.jar
[INFO] Downloaded: http://repo.maven.apache.org/maven2/org/apache/maven/wagon/wagon-http-lightweight/2.5/wagon-http-lightweight-2.5.jar
(16 KB at 242.4 KB/sec)
[INFO] Downloading: http://repo.maven.apache.org/maven2/org/slf4j/slf4j-api/1.6.4/slf4j-api-1.6.4.jar
[INFO] Downloaded: http://repo.maven.apache.org/maven2/org/apache/maven/wagon/wagon-file/2.5/wagon-file-2.5.jar
(11 KB at 154.9 KB/sec)
[INFO] Downloading: http://repo.maven.apache.org/maven2/ch/qos/logback/logback-classic/1.0.1/logback-classic-1.0.1.jar
[INFO] Downloaded: http://repo.maven.apache.org/maven2/org/apache/maven/wagon/wagon-http-shared/2.5/wagon-http-shared-2.5.jar
(11 KB at 152.3 KB/sec)
[INFO] Downloading: http://repo.maven.apache.org/maven2/ch/qos/logback/logback-core/1.0.1/logback-core-1.0.1.jar
[INFO] Downloaded: http://repo.maven.apache.org/maven2/org/ops4j/pax/url/pax-url-wrap/2.0.0/pax-url-wrap-2.0.0.jar
(12 KB at 160.7 KB/sec)
[INFO] Downloading: http://repo.maven.apache.org/maven2/org/apache/felix/org.apache.felix.framework/4.2.0/org.apache.felix.framework-4.2.0.jar
[INFO] Downloaded: http://repo.maven.apache.org/maven2/org/ops4j/pax/swissbox/pax-swissbox-bnd/1.7.0/pax-swissbox-bnd-1.7.0.jar
(9 KB at 123.2 KB/sec)
[INFO] Downloaded: http://repo.maven.apache.org/maven2/org/slf4j/slf4j-api/1.6.4/slf4j-api-1.6.4.jar
(26 KB at 390.1 KB/sec)
[INFO] Downloaded: http://repo.maven.apache.org/maven2/ch/qos/logback/logback-classic/1.0.1/logback-classic-1.0.1.jar
(243 KB at 2578.6 KB/sec)
[INFO] Downloaded: http://repo.maven.apache.org/maven2/ch/qos/logback/logback-core/1.0.1/logback-core-1.0.1.jar
(323 KB at 2556.8 KB/sec)
[INFO] Downloaded: http://repo.maven.apache.org/maven2/org/apache/felix/org.apache.felix.framework/4.2.0/org.apache.felix.framework-4.2.0.jar
(505 KB at 3790.7 KB/sec)
[INFO] 
[INFO] --- maven-clean-plugin:2.5:clean (default-clean) @ httpcore5-osgi ---
[INFO] 
[INFO] --- maven-checkstyle-plugin:2.9.1:checkstyle (validate) @ httpcore5-osgi ---
[INFO] 
[INFO] --- maven-checkstyle-plugin:2.9.1:checkstyle (validate-main) @ httpcore5-osgi ---
[INFO] Starting audit...
Audit done.

[INFO] 
[INFO] --- maven-checkstyle-plugin:2.9.1:checkstyle (validate-test) @ httpcore5-osgi ---
[INFO] Starting audit...
Audit done.

[INFO] 
[INFO] --- maven-checkstyle-plugin:2.9.1:checkstyle (validate-examples) @ httpcore5-osgi ---
[INFO] 
[INFO] --- maven-remote-resources-plugin:1.4:process (default) @ httpcore5-osgi ---
[INFO] 
[INFO] --- buildnumber-maven-plugin:1.2:create (default) @ httpcore5-osgi ---
[INFO] Checking for local modifications: skipped.
[INFO] Updating project files from SCM: skipped.
[INFO] Executing: /bin/sh -c cd <https://builds.apache.org/job/httpcomponents-core-5.x/org.apache.httpcomponents.core5$httpcore5-osgi/ws/>
&& svn --non-interactive info
[INFO] Working directory: <https://builds.apache.org/job/httpcomponents-core-5.x/org.apache.httpcomponents.core5$httpcore5-osgi/ws/>
[INFO] Storing buildNumber: ?????? at timestamp: 1449795982010
[INFO] Executing: /bin/sh -c cd <https://builds.apache.org/job/httpcomponents-core-5.x/org.apache.httpcomponents.core5$httpcore5-osgi/ws/>
&& svn --non-interactive info
[INFO] Working directory: <https://builds.apache.org/job/httpcomponents-core-5.x/org.apache.httpcomponents.core5$httpcore5-osgi/ws/>
[INFO] Storing buildScmBranch: UNKNOWN_BRANCH
[INFO] 
[INFO] --- depends-maven-plugin:1.2:generate-depends-file (generate-depends-file) @ httpcore5-osgi
---
[INFO] Created: <https://builds.apache.org/job/httpcomponents-core-5.x/org.apache.httpcomponents.core5$httpcore5-osgi/ws/target/classes/META-INF/maven/dependencies.properties>
[INFO] 
[INFO] --- maven-resources-plugin:2.6:resources (default-resources) @ httpcore5-osgi ---
[INFO] Using 'UTF-8' encoding to copy filtered resources.
[INFO] skip non existing resourceDirectory <https://builds.apache.org/job/httpcomponents-core-5.x/org.apache.httpcomponents.core5$httpcore5-osgi/ws/src/main/resources>
[INFO] Copying 3 resources
[INFO] 
[INFO] --- maven-compiler-plugin:3.1:compile (default-compile) @ httpcore5-osgi ---
[INFO] No sources to compile
[INFO] 
[INFO] --- maven-resources-plugin:2.6:testResources (default-testResources) @ httpcore5-osgi
---
[INFO] Using 'UTF-8' encoding to copy filtered resources.
[INFO] Copying 1 resource
[INFO] Copying 3 resources
[INFO] 
[INFO] --- maven-compiler-plugin:3.1:testCompile (default-testCompile) @ httpcore5-osgi ---
[INFO] Changes detected - recompiling the module!
[INFO] Compiling 4 source files to <https://builds.apache.org/job/httpcomponents-core-5.x/org.apache.httpcomponents.core5$httpcore5-osgi/ws/target/test-classes>
[INFO] -------------------------------------------------------------
[ERROR] COMPILATION ERROR : 
[INFO] -------------------------------------------------------------
[ERROR] <https://builds.apache.org/job/httpcomponents-core-5.x/org.apache.httpcomponents.core5$httpcore5-osgi/ws/src/test/java/org/apache/hc/core5/http/osgi/ConcurrentIT.java>:[30,38]
package org.apache.hc.core5.concurrent does not exist
[ERROR] <https://builds.apache.org/job/httpcomponents-core-5.x/org.apache.httpcomponents.core5$httpcore5-osgi/ws/src/test/java/org/apache/hc/core5/http/osgi/ConcurrentIT.java>:[31,38]
package org.apache.hc.core5.concurrent does not exist
[ERROR] <https://builds.apache.org/job/httpcomponents-core-5.x/org.apache.httpcomponents.core5$httpcore5-osgi/ws/src/test/java/org/apache/hc/core5/http/osgi/ActuallyConnectIT.java>:[30,44]
package org.apache.hc.core5.http.integration does not exist
[ERROR] <https://builds.apache.org/job/httpcomponents-core-5.x/org.apache.httpcomponents.core5$httpcore5-osgi/ws/src/test/java/org/apache/hc/core5/http/osgi/ActuallyConnectIT.java>:[43,40]
cannot find symbol
  symbol: class TestSyncHttp
[ERROR] <https://builds.apache.org/job/httpcomponents-core-5.x/org.apache.httpcomponents.core5$httpcore5-osgi/ws/src/test/java/org/apache/hc/core5/http/osgi/AnnotationIT.java>:[30,38]
package org.apache.hc.core5.annotation does not exist
[ERROR] <https://builds.apache.org/job/httpcomponents-core-5.x/org.apache.httpcomponents.core5$httpcore5-osgi/ws/src/test/java/org/apache/hc/core5/http/osgi/AnnotationIT.java>:[38,6]
cannot find symbol
  symbol:   class Immutable
  location: class org.apache.hc.core5.http.osgi.AnnotationIT
[ERROR] <https://builds.apache.org/job/httpcomponents-core-5.x/org.apache.httpcomponents.core5$httpcore5-osgi/ws/src/test/java/org/apache/hc/core5/http/osgi/ConcurrentIT.java>:[41,13]
cannot find symbol
  symbol:   class BasicFuture
  location: class org.apache.hc.core5.http.osgi.ConcurrentIT
[ERROR] <https://builds.apache.org/job/httpcomponents-core-5.x/org.apache.httpcomponents.core5$httpcore5-osgi/ws/src/test/java/org/apache/hc/core5/http/osgi/ConcurrentIT.java>:[41,35]
cannot find symbol
  symbol:   class FutureCallback
  location: class org.apache.hc.core5.http.osgi.ConcurrentIT
[INFO] 8 errors 
[INFO] -------------------------------------------------------------

Mime
View raw message