hc-commits mailing list archives

Site index · List index
Message view « Date » · « Thread »
Top « Date » · « Thread »
From Apache Jenkins Server <jenk...@builds.apache.org>
Subject Build failed in Jenkins: httpcomponents-core-5.x #72
Date Sun, 06 Dec 2015 01:04:33 GMT
See <https://builds.apache.org/job/httpcomponents-core-5.x/72/changes>

Changes:

[olegk] Javadoc fix

------------------------------------------
[...truncated 480 lines...]
[INFO] Created: <https://builds.apache.org/job/httpcomponents-core-5.x/ws/httpcore-trunk/httpcore-osgi/target/classes/META-INF/maven/dependencies.properties>
[INFO] 
[INFO] --- maven-resources-plugin:2.6:resources (default-resources) @ httpcore5-osgi ---
[INFO] Using 'UTF-8' encoding to copy filtered resources.
[INFO] skip non existing resourceDirectory <https://builds.apache.org/job/httpcomponents-core-5.x/ws/httpcore-trunk/httpcore-osgi/src/main/resources>
[INFO] Copying 3 resources
[INFO] 
[INFO] --- maven-compiler-plugin:3.1:compile (default-compile) @ httpcore5-osgi ---
[INFO] No sources to compile
[INFO] 
[INFO] --- maven-resources-plugin:2.6:testResources (default-testResources) @ httpcore5-osgi
---
[INFO] Using 'UTF-8' encoding to copy filtered resources.
[INFO] Copying 1 resource
[INFO] Copying 3 resources
[INFO] 
[INFO] --- maven-compiler-plugin:3.1:testCompile (default-testCompile) @ httpcore5-osgi ---
[INFO] Changes detected - recompiling the module!
[INFO] Compiling 4 source files to <https://builds.apache.org/job/httpcomponents-core-5.x/ws/httpcore-trunk/httpcore-osgi/target/test-classes>
[INFO] 
[INFO] --- maven-surefire-plugin:2.15:test (default-test) @ httpcore5-osgi ---
[JENKINS] Recording test results[INFO] 
[INFO] --- maven-bundle-plugin:2.4.0:bundle (default-bundle) @ httpcore5-osgi ---

[WARNING] Bundle org.apache.httpcomponents.core5:httpcore5-osgi:bundle:5.0-alpha1-SNAPSHOT
: Unused Private-Package instructions, no such package(s) on the class path: [!*]
[INFO] 
[INFO] >>> maven-source-plugin:2.2.1:jar (attach-sources) @ httpcore5-osgi >>>
[INFO] 
[INFO] --- maven-checkstyle-plugin:2.9.1:checkstyle (validate) @ httpcore5-osgi ---
[INFO] 
[INFO] --- maven-checkstyle-plugin:2.9.1:checkstyle (validate-main) @ httpcore5-osgi ---
[INFO] Starting audit...
Audit done.

[INFO] 
[INFO] --- maven-checkstyle-plugin:2.9.1:checkstyle (validate-test) @ httpcore5-osgi ---
[INFO] Starting audit...
Audit done.

[INFO] 
[INFO] --- maven-checkstyle-plugin:2.9.1:checkstyle (validate-examples) @ httpcore5-osgi ---
[WARNING] Failed to getClass for org.apache.maven.plugin.source.SourceJarMojo
[INFO] 
[INFO] <<< maven-source-plugin:2.2.1:jar (attach-sources) @ httpcore5-osgi <<<
[INFO] 
[INFO] --- maven-source-plugin:2.2.1:jar (attach-sources) @ httpcore5-osgi ---
[INFO] Building jar: <https://builds.apache.org/job/httpcomponents-core-5.x/ws/httpcore-trunk/httpcore-osgi/target/org.apache.httpcomponents.httpcore_5.0-alpha1-SNAPSHOT-sources.jar>
[INFO] 
[INFO] --- maven-javadoc-plugin:2.9.1:jar (attach-javadocs) @ httpcore5-osgi ---
[INFO] 
[INFO] --- maven-site-plugin:3.3:attach-descriptor (attach-descriptor) @ httpcore5-osgi ---
[INFO] 
[INFO] --- maven-failsafe-plugin:2.15:integration-test (it) @ httpcore5-osgi ---
[INFO] Tests are skipped.
[INFO] 
[INFO] --- apache-rat-plugin:0.11:check (default) @ httpcore5-osgi ---
[INFO] 51 implicit excludes (use -debug for more details).
[INFO] Exclude: .pmd
[INFO] Exclude: src/docbkx/resources/**
[INFO] Exclude: src/test/resources/*.truststore
[INFO] 8 resources included (use -debug for more details)
Warning:  org.apache.xerces.jaxp.SAXParserImpl$JAXPSAXParser: Property 'http://www.oracle.com/xml/jaxp/properties/entityExpansionLimit'
is not recognized.
Compiler warnings:
  WARNING:  'org.apache.xerces.jaxp.SAXParserImpl: Property 'http://javax.xml.XMLConstants/property/accessExternalDTD'
is not recognized.'
Warning:  org.apache.xerces.parsers.SAXParser: Feature 'http://javax.xml.XMLConstants/feature/secure-processing'
is not recognized.
Warning:  org.apache.xerces.parsers.SAXParser: Property 'http://javax.xml.XMLConstants/property/accessExternalDTD'
is not recognized.
Warning:  org.apache.xerces.parsers.SAXParser: Property 'http://www.oracle.com/xml/jaxp/properties/entityExpansionLimit'
is not recognized.
[INFO] Rat check: Summary of files. Unapproved: 0 unknown: 0 generated: 0 approved: 6 licence.
[INFO] 
[INFO] --- maven-failsafe-plugin:2.15:verify (it) @ httpcore5-osgi ---
[INFO] Tests are skipped.
[INFO] 
[INFO] --- maven-install-plugin:2.4:install (default-install) @ httpcore5-osgi ---
[INFO] Installing <https://builds.apache.org/job/httpcomponents-core-5.x/ws/httpcore-trunk/httpcore-osgi/target/org.apache.httpcomponents.httpcore_5.0-alpha1-SNAPSHOT.jar>
to /home/jenkins/jenkins-slave/maven-repositories/2/org/apache/httpcomponents/core5/httpcore5-osgi/5.0-alpha1-SNAPSHOT/httpcore5-osgi-5.0-alpha1-SNAPSHOT.jar
[INFO] Installing <https://builds.apache.org/job/httpcomponents-core-5.x/ws/httpcore-trunk/httpcore-osgi/pom.xml>
to /home/jenkins/jenkins-slave/maven-repositories/2/org/apache/httpcomponents/core5/httpcore5-osgi/5.0-alpha1-SNAPSHOT/httpcore5-osgi-5.0-alpha1-SNAPSHOT.pom
[INFO] Installing <https://builds.apache.org/job/httpcomponents-core-5.x/ws/httpcore-trunk/httpcore-osgi/target/org.apache.httpcomponents.httpcore_5.0-alpha1-SNAPSHOT-sources.jar>
to /home/jenkins/jenkins-slave/maven-repositories/2/org/apache/httpcomponents/core5/httpcore5-osgi/5.0-alpha1-SNAPSHOT/httpcore5-osgi-5.0-alpha1-SNAPSHOT-sources.jar
[INFO] 
[INFO] --- maven-bundle-plugin:2.4.0:install (default-install) @ httpcore5-osgi ---
[INFO] Installing org/apache/httpcomponents/core5/httpcore5-osgi/5.0-alpha1-SNAPSHOT/httpcore5-osgi-5.0-alpha1-SNAPSHOT.jar
[INFO] Writing OBR metadata
[INFO]                                                                         
[INFO] ------------------------------------------------------------------------
[INFO] Building Apache HttpComponents Core Benchmarking Tool 5.0-alpha1-SNAPSHOT
[INFO] ------------------------------------------------------------------------
[INFO] 
[INFO] --- maven-clean-plugin:2.5:clean (default-clean) @ httpcore5-ab ---
[INFO] 
[INFO] --- maven-checkstyle-plugin:2.9.1:checkstyle (validate) @ httpcore5-ab ---
[INFO] Starting audit...
Audit done.

[INFO] 
[INFO] --- maven-checkstyle-plugin:2.9.1:checkstyle (validate-main) @ httpcore5-ab ---
[INFO] Starting audit...
Audit done.

[INFO] 
[INFO] --- maven-checkstyle-plugin:2.9.1:checkstyle (validate-test) @ httpcore5-ab ---
[INFO] Starting audit...
Audit done.

[INFO] 
[INFO] --- maven-checkstyle-plugin:2.9.1:checkstyle (validate-examples) @ httpcore5-ab ---
[INFO] 
[INFO] --- maven-remote-resources-plugin:1.4:process (default) @ httpcore5-ab ---
[INFO] 
[INFO] --- buildnumber-maven-plugin:1.2:create (default) @ httpcore5-ab ---
[INFO] Checking for local modifications: skipped.
[INFO] Updating project files from SCM: skipped.
[INFO] Executing: /bin/sh -c cd <https://builds.apache.org/job/httpcomponents-core-5.x/ws/httpcore-trunk/httpcore-ab>
&& svn --non-interactive info
[INFO] Working directory: <https://builds.apache.org/job/httpcomponents-core-5.x/ws/httpcore-trunk/httpcore-ab>
[INFO] Storing buildNumber: 1718073 at timestamp: 1449363878725
[INFO] Executing: /bin/sh -c cd <https://builds.apache.org/job/httpcomponents-core-5.x/ws/httpcore-trunk/httpcore-ab>
&& svn --non-interactive info
[INFO] Working directory: <https://builds.apache.org/job/httpcomponents-core-5.x/ws/httpcore-trunk/httpcore-ab>
[INFO] Storing buildScmBranch: trunk
[INFO] 
[INFO] --- maven-resources-plugin:2.6:resources (default-resources) @ httpcore5-ab ---
[INFO] Using 'UTF-8' encoding to copy filtered resources.
[INFO] skip non existing resourceDirectory <https://builds.apache.org/job/httpcomponents-core-5.x/ws/httpcore-trunk/httpcore-ab/src/main/resources>
[INFO] Copying 3 resources
[INFO] 
[INFO] --- maven-compiler-plugin:3.1:compile (default-compile) @ httpcore5-ab ---
[INFO] Changes detected - recompiling the module!
[INFO] Compiling 12 source files to <https://builds.apache.org/job/httpcomponents-core-5.x/ws/httpcore-trunk/httpcore-ab/target/classes>
[INFO] -------------------------------------------------------------
[ERROR] COMPILATION ERROR : 
[INFO] -------------------------------------------------------------
[ERROR] <https://builds.apache.org/job/httpcomponents-core-5.x/ws/httpcore-trunk/httpcore-ab/src/main/java/org/apache/hc/core5/http/benchmark/BenchmarkConnection.java>:[33,40]
cannot find symbol
  symbol:   class DefaultBHttpClientConnection
  location: package org.apache.hc.core5.http.impl.io
[ERROR] <https://builds.apache.org/job/httpcomponents-core-5.x/ws/httpcore-trunk/httpcore-ab/src/main/java/org/apache/hc/core5/http/benchmark/BenchmarkConnection.java>:[37,35]
cannot find symbol
  symbol: class DefaultBHttpClientConnection
[ERROR] <https://builds.apache.org/job/httpcomponents-core-5.x/ws/httpcore-trunk/httpcore-ab/src/main/java/org/apache/hc/core5/http/benchmark/BenchmarkWorker.java>:[52,40]
cannot find symbol
  symbol:   class HttpRequestExecutor
  location: package org.apache.hc.core5.http.impl.io
[ERROR] <https://builds.apache.org/job/httpcomponents-core-5.x/ws/httpcore-trunk/httpcore-ab/src/main/java/org/apache/hc/core5/http/benchmark/BenchmarkWorker.java>:[70,19]
cannot find symbol
  symbol:   class HttpRequestExecutor
  location: class org.apache.hc.core5.http.benchmark.BenchmarkWorker
[ERROR] <https://builds.apache.org/job/httpcomponents-core-5.x/ws/httpcore-trunk/httpcore-ab/src/main/java/org/apache/hc/core5/http/benchmark/BenchmarkConnection.java>:[51,17]
cannot find symbol
  symbol:   variable super
  location: class org.apache.hc.core5.http.benchmark.BenchmarkConnection
[ERROR] <https://builds.apache.org/job/httpcomponents-core-5.x/ws/httpcore-trunk/httpcore-ab/src/main/java/org/apache/hc/core5/http/benchmark/BenchmarkConnection.java>:[46,5]
method does not override or implement a method from a supertype
[ERROR] <https://builds.apache.org/job/httpcomponents-core-5.x/ws/httpcore-trunk/httpcore-ab/src/main/java/org/apache/hc/core5/http/benchmark/BenchmarkConnection.java>:[57,40]
cannot find symbol
  symbol:   variable super
  location: class org.apache.hc.core5.http.benchmark.BenchmarkConnection
[ERROR] <https://builds.apache.org/job/httpcomponents-core-5.x/ws/httpcore-trunk/httpcore-ab/src/main/java/org/apache/hc/core5/http/benchmark/BenchmarkConnection.java>:[55,5]
method does not override or implement a method from a supertype
[ERROR] <https://builds.apache.org/job/httpcomponents-core-5.x/ws/httpcore-trunk/httpcore-ab/src/main/java/org/apache/hc/core5/http/benchmark/BenchmarkWorker.java>:[98,33]
cannot find symbol
  symbol:   class HttpRequestExecutor
  location: class org.apache.hc.core5.http.benchmark.BenchmarkWorker
[ERROR] <https://builds.apache.org/job/httpcomponents-core-5.x/ws/httpcore-trunk/httpcore-ab/src/main/java/org/apache/hc/core5/http/benchmark/BenchmarkWorker.java>:[129,26]
cannot find symbol
  symbol:   method isOpen()
  location: variable conn of type org.apache.hc.core5.http.benchmark.BenchmarkConnection
[ERROR] <https://builds.apache.org/job/httpcomponents-core-5.x/ws/httpcore-trunk/httpcore-ab/src/main/java/org/apache/hc/core5/http/benchmark/BenchmarkWorker.java>:[142,25]
cannot find symbol
  symbol:   method bind(java.net.Socket)
  location: variable conn of type org.apache.hc.core5.http.benchmark.BenchmarkConnection
[ERROR] <https://builds.apache.org/job/httpcomponents-core-5.x/ws/httpcore-trunk/httpcore-ab/src/main/java/org/apache/hc/core5/http/benchmark/BenchmarkWorker.java>:[158,25]
cannot find symbol
  symbol:   method shutdown()
  location: variable conn of type org.apache.hc.core5.http.benchmark.BenchmarkConnection
[ERROR] <https://builds.apache.org/job/httpcomponents-core-5.x/ws/httpcore-trunk/httpcore-ab/src/main/java/org/apache/hc/core5/http/benchmark/BenchmarkWorker.java>:[196,51]
cannot find symbol
  symbol:   method isConsistent()
  location: variable conn of type org.apache.hc.core5.http.benchmark.BenchmarkConnection
[ERROR] <https://builds.apache.org/job/httpcomponents-core-5.x/ws/httpcore-trunk/httpcore-ab/src/main/java/org/apache/hc/core5/http/benchmark/BenchmarkWorker.java>:[197,25]
cannot find symbol
  symbol:   method close()
  location: variable conn of type org.apache.hc.core5.http.benchmark.BenchmarkConnection
[ERROR] <https://builds.apache.org/job/httpcomponents-core-5.x/ws/httpcore-trunk/httpcore-ab/src/main/java/org/apache/hc/core5/http/benchmark/BenchmarkWorker.java>:[225,17]
cannot find symbol
  symbol:   method close()
  location: variable conn of type org.apache.hc.core5.http.benchmark.BenchmarkConnection
[INFO] 15 errors 
[INFO] -------------------------------------------------------------
[INFO] ------------------------------------------------------------------------
[INFO] Reactor Summary:
[INFO] 
[INFO] Apache HttpComponents Core Parent ................. SUCCESS [  7.799 s]
[INFO] Apache HttpComponents Core ........................ SUCCESS [01:05 min]
[INFO] Apache HttpComponents Core OSGi bundle ............ SUCCESS [ 15.461 s]
[INFO] Apache HttpComponents Core Benchmarking Tool ...... FAILURE [  1.447 s]
[INFO] ------------------------------------------------------------------------
[INFO] BUILD FAILURE
[INFO] ------------------------------------------------------------------------
[INFO] Total time: 01:33 min
[INFO] Finished at: 2015-12-06T01:04:39+00:00
[INFO] Final Memory: 62M/382M
[INFO] ------------------------------------------------------------------------
[ERROR] Failed to execute goal org.apache.maven.plugins:maven-compiler-plugin:3.1:compile
(default-compile) on project httpcore5-ab: Compilation failure: Compilation failure:
[ERROR] <https://builds.apache.org/job/httpcomponents-core-5.x/ws/httpcore-trunk/httpcore-ab/src/main/java/org/apache/hc/core5/http/benchmark/BenchmarkConnection.java>:[33,40]
cannot find symbol
[ERROR] symbol:   class DefaultBHttpClientConnection
[ERROR] location: package org.apache.hc.core5.http.impl.io
[ERROR] <https://builds.apache.org/job/httpcomponents-core-5.x/ws/httpcore-trunk/httpcore-ab/src/main/java/org/apache/hc/core5/http/benchmark/BenchmarkConnection.java>:[37,35]
cannot find symbol
[ERROR] symbol: class DefaultBHttpClientConnection
[ERROR] <https://builds.apache.org/job/httpcomponents-core-5.x/ws/httpcore-trunk/httpcore-ab/src/main/java/org/apache/hc/core5/http/benchmark/BenchmarkWorker.java>:[52,40]
cannot find symbol
[ERROR] symbol:   class HttpRequestExecutor
[ERROR] location: package org.apache.hc.core5.http.impl.io
[ERROR] <https://builds.apache.org/job/httpcomponents-core-5.x/ws/httpcore-trunk/httpcore-ab/src/main/java/org/apache/hc/core5/http/benchmark/BenchmarkWorker.java>:[70,19]
cannot find symbol
[ERROR] symbol:   class HttpRequestExecutor
[ERROR] location: class org.apache.hc.core5.http.benchmark.BenchmarkWorker
[ERROR] <https://builds.apache.org/job/httpcomponents-core-5.x/ws/httpcore-trunk/httpcore-ab/src/main/java/org/apache/hc/core5/http/benchmark/BenchmarkConnection.java>:[51,17]
cannot find symbol
[ERROR] symbol:   variable super
[ERROR] location: class org.apache.hc.core5.http.benchmark.BenchmarkConnection
[ERROR] <https://builds.apache.org/job/httpcomponents-core-5.x/ws/httpcore-trunk/httpcore-ab/src/main/java/org/apache/hc/core5/http/benchmark/BenchmarkConnection.java>:[46,5]
method does not override or implement a method from a supertype
[ERROR] <https://builds.apache.org/job/httpcomponents-core-5.x/ws/httpcore-trunk/httpcore-ab/src/main/java/org/apache/hc/core5/http/benchmark/BenchmarkConnection.java>:[57,40]
cannot find symbol
[ERROR] symbol:   variable super
[ERROR] location: class org.apache.hc.core5.http.benchmark.BenchmarkConnection
[ERROR] <https://builds.apache.org/job/httpcomponents-core-5.x/ws/httpcore-trunk/httpcore-ab/src/main/java/org/apache/hc/core5/http/benchmark/BenchmarkConnection.java>:[55,5]
method does not override or implement a method from a supertype
[ERROR] <https://builds.apache.org/job/httpcomponents-core-5.x/ws/httpcore-trunk/httpcore-ab/src/main/java/org/apache/hc/core5/http/benchmark/BenchmarkWorker.java>:[98,33]
cannot find symbol
[ERROR] symbol:   class HttpRequestExecutor
[ERROR] location: class org.apache.hc.core5.http.benchmark.BenchmarkWorker
[ERROR] <https://builds.apache.org/job/httpcomponents-core-5.x/ws/httpcore-trunk/httpcore-ab/src/main/java/org/apache/hc/core5/http/benchmark/BenchmarkWorker.java>:[129,26]
cannot find symbol
[ERROR] symbol:   method isOpen()
[ERROR] location: variable conn of type org.apache.hc.core5.http.benchmark.BenchmarkConnection
[ERROR] <https://builds.apache.org/job/httpcomponents-core-5.x/ws/httpcore-trunk/httpcore-ab/src/main/java/org/apache/hc/core5/http/benchmark/BenchmarkWorker.java>:[142,25]
cannot find symbol
[ERROR] symbol:   method bind(java.net.Socket)
[ERROR] location: variable conn of type org.apache.hc.core5.http.benchmark.BenchmarkConnection
[ERROR] <https://builds.apache.org/job/httpcomponents-core-5.x/ws/httpcore-trunk/httpcore-ab/src/main/java/org/apache/hc/core5/http/benchmark/BenchmarkWorker.java>:[158,25]
cannot find symbol
[ERROR] symbol:   method shutdown()
[ERROR] location: variable conn of type org.apache.hc.core5.http.benchmark.BenchmarkConnection
[ERROR] <https://builds.apache.org/job/httpcomponents-core-5.x/ws/httpcore-trunk/httpcore-ab/src/main/java/org/apache/hc/core5/http/benchmark/BenchmarkWorker.java>:[196,51]
cannot find symbol
[ERROR] symbol:   method isConsistent()
[ERROR] location: variable conn of type org.apache.hc.core5.http.benchmark.BenchmarkConnection
[ERROR] <https://builds.apache.org/job/httpcomponents-core-5.x/ws/httpcore-trunk/httpcore-ab/src/main/java/org/apache/hc/core5/http/benchmark/BenchmarkWorker.java>:[197,25]
cannot find symbol
[ERROR] symbol:   method close()
[ERROR] location: variable conn of type org.apache.hc.core5.http.benchmark.BenchmarkConnection
[ERROR] <https://builds.apache.org/job/httpcomponents-core-5.x/ws/httpcore-trunk/httpcore-ab/src/main/java/org/apache/hc/core5/http/benchmark/BenchmarkWorker.java>:[225,17]
cannot find symbol
[ERROR] symbol:   method close()
[ERROR] location: variable conn of type org.apache.hc.core5.http.benchmark.BenchmarkConnection
[ERROR] -> [Help 1]
[ERROR] 
[ERROR] To see the full stack trace of the errors, re-run Maven with the -e switch.
[ERROR] Re-run Maven using the -X switch to enable full debug logging.
[ERROR] 
[ERROR] For more information about the errors and possible solutions, please read the following
articles:
[ERROR] [Help 1] http://cwiki.apache.org/confluence/display/MAVEN/MojoFailureException
[ERROR] 
[ERROR] After correcting the problems, you can resume the build with the command
[ERROR]   mvn <goals> -rf :httpcore5-ab
[JENKINS] Archiving <https://builds.apache.org/job/httpcomponents-core-5.x/ws/httpcore-trunk/httpcore/pom.xml>
to org.apache.httpcomponents.core5/httpcore5/5.0-alpha1-SNAPSHOT/httpcore5-5.0-alpha1-SNAPSHOT.pom
[JENKINS] Archiving <https://builds.apache.org/job/httpcomponents-core-5.x/ws/httpcore-trunk/httpcore/target/httpcore5-5.0-alpha1-SNAPSHOT.jar>
to org.apache.httpcomponents.core5/httpcore5/5.0-alpha1-SNAPSHOT/httpcore5-5.0-alpha1-SNAPSHOT.jar
[JENKINS] Archiving <https://builds.apache.org/job/httpcomponents-core-5.x/ws/httpcore-trunk/httpcore/target/httpcore5-5.0-alpha1-SNAPSHOT-sources.jar>
to org.apache.httpcomponents.core5/httpcore5/5.0-alpha1-SNAPSHOT/httpcore5-5.0-alpha1-SNAPSHOT-sources.jar
[JENKINS] Archiving <https://builds.apache.org/job/httpcomponents-core-5.x/ws/httpcore-trunk/httpcore/target/httpcore5-5.0-alpha1-SNAPSHOT-javadoc.jar>
to org.apache.httpcomponents.core5/httpcore5/5.0-alpha1-SNAPSHOT/httpcore5-5.0-alpha1-SNAPSHOT-javadoc.jar
[JENKINS] Archiving <https://builds.apache.org/job/httpcomponents-core-5.x/ws/httpcore-trunk/httpcore/target/httpcore5-5.0-alpha1-SNAPSHOT-tests.jar>
to org.apache.httpcomponents.core5/httpcore5/5.0-alpha1-SNAPSHOT/httpcore5-5.0-alpha1-SNAPSHOT-tests.jar
Compressed 3.56 MB of artifacts by 12.3% relative to #71
[JENKINS] Archiving <https://builds.apache.org/job/httpcomponents-core-5.x/ws/httpcore-trunk/httpcore-ab/pom.xml>
to org.apache.httpcomponents.core5/httpcore5-ab/5.0-alpha1-SNAPSHOT/httpcore5-ab-5.0-alpha1-SNAPSHOT.pom
No prior successful build to compare, so performing full copy of artifacts
[JENKINS] Archiving <https://builds.apache.org/job/httpcomponents-core-5.x/ws/httpcore-trunk/httpcore-osgi/pom.xml>
to org.apache.httpcomponents.core5/httpcore5-osgi/5.0-alpha1-SNAPSHOT/httpcore5-osgi-5.0-alpha1-SNAPSHOT.pom
[JENKINS] Archiving <https://builds.apache.org/job/httpcomponents-core-5.x/ws/httpcore-trunk/httpcore-osgi/target/org.apache.httpcomponents.httpcore_5.0-alpha1-SNAPSHOT.jar>
to org.apache.httpcomponents.core5/httpcore5-osgi/5.0-alpha1-SNAPSHOT/httpcore5-osgi-5.0-alpha1-SNAPSHOT.jar
[JENKINS] Archiving <https://builds.apache.org/job/httpcomponents-core-5.x/ws/httpcore-trunk/httpcore-osgi/target/org.apache.httpcomponents.httpcore_5.0-alpha1-SNAPSHOT-sources.jar>
to org.apache.httpcomponents.core5/httpcore5-osgi/5.0-alpha1-SNAPSHOT/httpcore5-osgi-5.0-alpha1-SNAPSHOT-sources.jar
No prior successful build to compare, so performing full copy of artifacts
[JENKINS] Archiving <https://builds.apache.org/job/httpcomponents-core-5.x/ws/httpcore-trunk/pom.xml>
to org.apache.httpcomponents.core5/httpcore5-parent/5.0-alpha1-SNAPSHOT/httpcore5-parent-5.0-alpha1-SNAPSHOT.pom
Sending e-mails to: commits@hc.apache.org
Sending e-mails to: commits@hc.apache.org
channel stopped

Mime
View raw message