hc-commits mailing list archives

Site index · List index
Message view « Date » · « Thread »
Top « Date » · « Thread »
From Apache Jenkins Server <jenk...@builds.apache.org>
Subject Build failed in Jenkins: httpcomponents-asyncclient-4.1.x #43
Date Tue, 25 Aug 2015 12:18:18 GMT
See <https://builds.apache.org/job/httpcomponents-asyncclient-4.1.x/43/changes>

Changes:

[ggregory] Better JUnit assert message.

[ggregory] commons-logging 1.1.x -> 1.2.

[ggregory] Do not check Maven-Eclipse files for RAT reports.

------------------------------------------
Started by an SCM change
[EnvInject] - Loading node environment variables.
Building remotely on ubuntu-1 (docker Ubuntu ubuntu ubuntu1) in workspace <https://builds.apache.org/job/httpcomponents-asyncclient-4.1.x/ws/>
Updating http://svn.apache.org/repos/asf/httpcomponents/httpasyncclient/trunk at revision
'2015-08-25T12:18:16.198 +0000'
U         httpasyncclient-osgi/pom.xml
U         httpasyncclient/src/test/java/org/apache/http/nio/client/integration/TestHttpAsyncPrematureTermination.java
U         httpasyncclient/pom.xml
U         httpasyncclient-cache/pom.xml
At revision 1697660
Parsing POMs
ERROR: Failed to parse POMs
java.io.IOException: remote file operation failed: <https://builds.apache.org/job/httpcomponents-asyncclient-4.1.x/ws/httpasyncclient-trunk>
at hudson.remoting.Channel@2106512c:ubuntu-1
	at hudson.FilePath.act(FilePath.java:916)
	at hudson.FilePath.act(FilePath.java:893)
	at hudson.maven.MavenModuleSetBuild$MavenModuleSetBuildExecution.parsePoms(MavenModuleSetBuild.java:950)
	at hudson.maven.MavenModuleSetBuild$MavenModuleSetBuildExecution.doRun(MavenModuleSetBuild.java:677)
	at hudson.model.AbstractBuild$AbstractBuildExecution.run(AbstractBuild.java:529)
	at hudson.model.Run.execute(Run.java:1706)
	at hudson.maven.MavenModuleSetBuild.run(MavenModuleSetBuild.java:529)
	at hudson.model.ResourceController.execute(ResourceController.java:88)
	at hudson.model.Executor.run(Executor.java:232)
Caused by: hudson.remoting.ProxyException: hudson.maven.MavenModuleSetBuild$MavenExecutionException:
org.apache.maven.project.ProjectBuildingException: Some problems were encountered while processing
the POMs:
[ERROR] 'build.plugins.plugin.version' for org.apache.rat:apache-rat-plugin must be a valid
version but is '${hc.rat.version}'. @ line 93, column 18
[ERROR] 'build.plugins.plugin.version' for org.apache.rat:apache-rat-plugin must be a valid
version but is '${hc.rat.version}'. @ line 86, column 18
[ERROR] 'build.plugins.plugin.version' for org.apache.rat:apache-rat-plugin must be a valid
version but is '${hc.rat.version}'. @ line 139, column 18

	at hudson.maven.MavenModuleSetBuild$PomParser.invoke(MavenModuleSetBuild.java:1354)
	at hudson.maven.MavenModuleSetBuild$PomParser.invoke(MavenModuleSetBuild.java:1088)
	at hudson.FilePath$FileCallableWrapper.call(FilePath.java:2474)
	at hudson.remoting.UserRequest.perform(UserRequest.java:118)
	at hudson.remoting.UserRequest.perform(UserRequest.java:48)
	at hudson.remoting.Request$2.run(Request.java:328)
	at hudson.remoting.InterceptingExecutorService$1.call(InterceptingExecutorService.java:72)
	at java.util.concurrent.FutureTask.run(FutureTask.java:262)
	at java.util.concurrent.ThreadPoolExecutor.runWorker(ThreadPoolExecutor.java:1145)
	at java.util.concurrent.ThreadPoolExecutor$Worker.run(ThreadPoolExecutor.java:615)
	at java.lang.Thread.run(Thread.java:745)
Caused by: hudson.remoting.ProxyException: org.apache.maven.project.ProjectBuildingException:
Some problems were encountered while processing the POMs:
[ERROR] 'build.plugins.plugin.version' for org.apache.rat:apache-rat-plugin must be a valid
version but is '${hc.rat.version}'. @ line 93, column 18
[ERROR] 'build.plugins.plugin.version' for org.apache.rat:apache-rat-plugin must be a valid
version but is '${hc.rat.version}'. @ line 86, column 18
[ERROR] 'build.plugins.plugin.version' for org.apache.rat:apache-rat-plugin must be a valid
version but is '${hc.rat.version}'. @ line 139, column 18

	at org.apache.maven.project.DefaultProjectBuilder.build(DefaultProjectBuilder.java:364)
	at hudson.maven.MavenEmbedder.buildProjects(MavenEmbedder.java:361)
	at hudson.maven.MavenEmbedder.readProjects(MavenEmbedder.java:331)
	at hudson.maven.MavenModuleSetBuild$PomParser.invoke(MavenModuleSetBuild.java:1291)
	... 10 more

Mime
View raw message