hc-commits mailing list archives

Site index · List index
Message view « Date » · « Thread »
Top « Date » · « Thread »
From Apache Jenkins Server <jenk...@builds.apache.org>
Subject Build failed in Jenkins: httpcomponents-asyncclient-4.0.x #340
Date Fri, 11 Apr 2014 19:31:45 GMT
See <https://builds.apache.org/job/httpcomponents-asyncclient-4.0.x/340/>

------------------------------------------
[...truncated 475 lines...]
Running org.apache.http.impl.nio.conn.TestPoolingHttpClientAsyncConnectionManager
Tests run: 25, Failures: 0, Errors: 0, Skipped: 0, Time elapsed: 0.732 sec - in org.apache.http.impl.nio.conn.TestPoolingHttpClientAsyncConnectionManager
Running org.apache.http.nio.client.integration.TestClientAuthentication
Tests run: 11, Failures: 0, Errors: 0, Skipped: 0, Time elapsed: 0.92 sec - in org.apache.http.nio.client.integration.TestClientAuthentication
Running org.apache.http.nio.client.integration.TestHttpAsyncClientUtils
Tests run: 1, Failures: 0, Errors: 0, Skipped: 0, Time elapsed: 0.012 sec - in org.apache.http.nio.client.integration.TestHttpAsyncClientUtils
Running org.apache.http.nio.client.integration.TestHttpAsyncPrematureTermination
Tests run: 3, Failures: 0, Errors: 0, Skipped: 0, Time elapsed: 0.041 sec - in org.apache.http.nio.client.integration.TestHttpAsyncPrematureTermination
Running org.apache.http.nio.client.integration.TestStatefulConnManagement
Tests run: 2, Failures: 0, Errors: 0, Skipped: 0, Time elapsed: 0.252 sec - in org.apache.http.nio.client.integration.TestStatefulConnManagement
Running org.apache.http.nio.client.integration.TestHttpAsyncMinimal
Tests run: 4, Failures: 0, Errors: 0, Skipped: 0, Time elapsed: 0.141 sec - in org.apache.http.nio.client.integration.TestHttpAsyncMinimal
Running org.apache.http.nio.client.integration.TestHttpsRedirects
Tests run: 23, Failures: 0, Errors: 0, Skipped: 0, Time elapsed: 2.433 sec - in org.apache.http.nio.client.integration.TestHttpsRedirects
Running org.apache.http.nio.client.integration.TestHttpAsync
Tests run: 5, Failures: 0, Errors: 0, Skipped: 0, Time elapsed: 0.003 sec - in org.apache.http.nio.client.integration.TestHttpAsync
Running org.apache.http.nio.client.integration.TestClientReauthentication
Tests run: 1, Failures: 0, Errors: 0, Skipped: 0, Time elapsed: 0.05 sec - in org.apache.http.nio.client.integration.TestClientReauthentication
Running org.apache.http.nio.client.integration.TestHttpsAsync
Tests run: 5, Failures: 0, Errors: 0, Skipped: 0, Time elapsed: 0.418 sec - in org.apache.http.nio.client.integration.TestHttpsAsync
Running org.apache.http.nio.client.integration.TestRedirects
Tests run: 23, Failures: 0, Errors: 0, Skipped: 0, Time elapsed: 0.339 sec - in org.apache.http.nio.client.integration.TestRedirects
Running org.apache.http.nio.client.integration.TestClientAuthenticationFallBack
Tests run: 1, Failures: 0, Errors: 0, Skipped: 0, Time elapsed: 0.018 sec - in org.apache.http.nio.client.integration.TestClientAuthenticationFallBack
Running org.apache.http.nio.client.methods.TestAsyncConsumers
Tests run: 7, Failures: 0, Errors: 0, Skipped: 0, Time elapsed: 0.179 sec - in org.apache.http.nio.client.methods.TestAsyncConsumers
Running org.apache.http.nio.client.methods.TestZeroCopy
Tests run: 2, Failures: 0, Errors: 0, Skipped: 0, Time elapsed: 0.18 sec - in org.apache.http.nio.client.methods.TestZeroCopy

Results :

Tests run: 113, Failures: 0, Errors: 0, Skipped: 0

[JENKINS] Recording test results
[INFO] 
[INFO] --- maven-jar-plugin:2.4:jar (default-jar) @ httpasyncclient ---
[INFO] Building jar: <https://builds.apache.org/job/httpcomponents-asyncclient-4.0.x/ws/httpasyncclient-4.0.x/httpasyncclient/target/httpasyncclient-4.0.2-SNAPSHOT.jar>
[INFO] 
[INFO] --- maven-checkstyle-plugin:2.9.1:checkstyle (validate) @ httpasyncclient ---
[INFO] Starting audit...
Audit done.

[INFO] 
[INFO] --- maven-checkstyle-plugin:2.9.1:checkstyle (validate-main) @ httpasyncclient ---
[INFO] Starting audit...
Audit done.

[INFO] 
[INFO] --- maven-checkstyle-plugin:2.9.1:checkstyle (validate-test) @ httpasyncclient ---
[INFO] Starting audit...
Audit done.

[INFO] 
[INFO] --- maven-checkstyle-plugin:2.9.1:checkstyle (validate-examples) @ httpasyncclient
---
[INFO] Starting audit...
Audit done.

[INFO] 
[INFO] --- build-helper-maven-plugin:1.8:add-source (add-source) @ httpasyncclient ---
[INFO] Source directory: <https://builds.apache.org/job/httpcomponents-asyncclient-4.0.x/ws/httpasyncclient-4.0.x/httpasyncclient/src/main/java-deprecated>
added.
[WARNING] Failed to getClass for org.apache.maven.plugin.source.SourceJarMojo
[INFO] 
[INFO] --- maven-source-plugin:2.2.1:jar (attach-sources) @ httpasyncclient ---
[INFO] Building jar: <https://builds.apache.org/job/httpcomponents-asyncclient-4.0.x/ws/httpasyncclient-4.0.x/httpasyncclient/target/httpasyncclient-4.0.2-SNAPSHOT-sources.jar>
[INFO] 
[INFO] --- maven-site-plugin:3.3:attach-descriptor (attach-descriptor) @ httpasyncclient ---
[INFO] 
[INFO] --- maven-install-plugin:2.4:install (default-install) @ httpasyncclient ---
[INFO] Installing <https://builds.apache.org/job/httpcomponents-asyncclient-4.0.x/ws/httpasyncclient-4.0.x/httpasyncclient/target/httpasyncclient-4.0.2-SNAPSHOT.jar>
to /export/home/hudson/hudson-slave/maven-repositories/0/org/apache/httpcomponents/httpasyncclient/4.0.2-SNAPSHOT/httpasyncclient-4.0.2-SNAPSHOT.jar
[INFO] Installing <https://builds.apache.org/job/httpcomponents-asyncclient-4.0.x/ws/httpasyncclient-4.0.x/httpasyncclient/pom.xml>
to /export/home/hudson/hudson-slave/maven-repositories/0/org/apache/httpcomponents/httpasyncclient/4.0.2-SNAPSHOT/httpasyncclient-4.0.2-SNAPSHOT.pom
[INFO] Installing <https://builds.apache.org/job/httpcomponents-asyncclient-4.0.x/ws/httpasyncclient-4.0.x/httpasyncclient/target/httpasyncclient-4.0.2-SNAPSHOT-sources.jar>
to /export/home/hudson/hudson-slave/maven-repositories/0/org/apache/httpcomponents/httpasyncclient/4.0.2-SNAPSHOT/httpasyncclient-4.0.2-SNAPSHOT-sources.jar
[INFO]                                                                         
[INFO] ------------------------------------------------------------------------
[INFO] Building Apache HttpAsyncClient Cache 4.0.2-SNAPSHOT
[INFO] ------------------------------------------------------------------------
Downloading: http://repo.maven.apache.org/maven2/org/apache/httpcomponents/httpclient-cache/4.3.3/httpclient-cache-4.3.3.pom
Downloaded: http://repo.maven.apache.org/maven2/org/apache/httpcomponents/httpclient-cache/4.3.3/httpclient-cache-4.3.3.pom
(7 KB at 55.7 KB/sec)
Downloading: http://repo.maven.apache.org/maven2/org/apache/httpcomponents/httpclient-cache/4.3.3/httpclient-cache-4.3.3-tests.jar
Downloading: http://repo.maven.apache.org/maven2/org/apache/httpcomponents/httpclient-cache/4.3.3/httpclient-cache-4.3.3.jar
Downloaded: http://repo.maven.apache.org/maven2/org/apache/httpcomponents/httpclient-cache/4.3.3/httpclient-cache-4.3.3.jar
(147 KB at 1261.1 KB/sec)
Downloaded: http://repo.maven.apache.org/maven2/org/apache/httpcomponents/httpclient-cache/4.3.3/httpclient-cache-4.3.3-tests.jar
(224 KB at 1631.3 KB/sec)
[INFO] 
[INFO] --- maven-clean-plugin:2.5:clean (default-clean) @ httpasyncclient-cache ---
[INFO] 
[INFO] --- maven-checkstyle-plugin:2.9.1:checkstyle (validate) @ httpasyncclient-cache ---
[INFO] Starting audit...
Audit done.

[INFO] 
[INFO] --- maven-checkstyle-plugin:2.9.1:checkstyle (validate-main) @ httpasyncclient-cache
---
[INFO] Starting audit...
Audit done.

[INFO] 
[INFO] --- maven-checkstyle-plugin:2.9.1:checkstyle (validate-test) @ httpasyncclient-cache
---
[INFO] Starting audit...
Audit done.

[INFO] 
[INFO] --- maven-checkstyle-plugin:2.9.1:checkstyle (validate-examples) @ httpasyncclient-cache
---
[INFO] 
[INFO] --- maven-remote-resources-plugin:1.4:process (default) @ httpasyncclient-cache ---
[INFO] 
[INFO] --- buildnumber-maven-plugin:1.2:create (default) @ httpasyncclient-cache ---
[INFO] Checking for local modifications: skipped.
[INFO] Updating project files from SCM: skipped.
[INFO] Executing: /bin/sh -c cd <https://builds.apache.org/job/httpcomponents-asyncclient-4.0.x/ws/httpasyncclient-4.0.x/httpasyncclient-cache>
&& svn --non-interactive info
[INFO] Working directory: <https://builds.apache.org/job/httpcomponents-asyncclient-4.0.x/ws/httpasyncclient-4.0.x/httpasyncclient-cache>
[INFO] Storing buildNumber: 1572563 at timestamp: 1397244393140
[INFO] Executing: /bin/sh -c cd <https://builds.apache.org/job/httpcomponents-asyncclient-4.0.x/ws/httpasyncclient-4.0.x/httpasyncclient-cache>
&& svn --non-interactive info
[INFO] Working directory: <https://builds.apache.org/job/httpcomponents-asyncclient-4.0.x/ws/httpasyncclient-4.0.x/httpasyncclient-cache>
[INFO] Storing buildScmBranch: branches/4.0.x/httpasyncclient-cache
[INFO] 
[INFO] --- maven-resources-plugin:2.6:resources (default-resources) @ httpasyncclient-cache
---
[INFO] Using 'UTF-8' encoding to copy filtered resources.
[INFO] skip non existing resourceDirectory <https://builds.apache.org/job/httpcomponents-asyncclient-4.0.x/ws/httpasyncclient-4.0.x/httpasyncclient-cache/src/main/resources>
[INFO] Copying 3 resources
[INFO] 
[INFO] --- maven-compiler-plugin:3.1:compile (default-compile) @ httpasyncclient-cache ---
[INFO] Changes detected - recompiling the module!
[INFO] Compiling 5 source files to <https://builds.apache.org/job/httpcomponents-asyncclient-4.0.x/ws/httpasyncclient-4.0.x/httpasyncclient-cache/target/classes>
[INFO] 
[INFO] --- maven-resources-plugin:2.6:testResources (default-testResources) @ httpasyncclient-cache
---
[INFO] Using 'UTF-8' encoding to copy filtered resources.
[INFO] Copying 1 resource
[INFO] Copying 3 resources
[INFO] 
[INFO] --- maven-compiler-plugin:3.1:testCompile (default-testCompile) @ httpasyncclient-cache
---
[INFO] Changes detected - recompiling the module!
[INFO] Compiling 7 source files to <https://builds.apache.org/job/httpcomponents-asyncclient-4.0.x/ws/httpasyncclient-4.0.x/httpasyncclient-cache/target/test-classes>
[WARNING] <https://builds.apache.org/job/httpcomponents-asyncclient-4.0.x/ws/httpasyncclient-4.0.x/httpasyncclient-cache/src/test/java/org/apache/http/impl/client/cache/ClientExecChainAsyncClient.java>:[40,32]
[deprecation] org.apache.http.nio.conn.ClientAsyncConnectionManager in org.apache.http.nio.conn
has been deprecated
[WARNING] <https://builds.apache.org/job/httpcomponents-asyncclient-4.0.x/ws/httpasyncclient-4.0.x/httpasyncclient-cache/src/test/java/org/apache/http/impl/client/cache/ClientExecChainAsyncClient.java>:[44,30]
[deprecation] org.apache.http.params.HttpParams in org.apache.http.params has been deprecated
[WARNING] <https://builds.apache.org/job/httpcomponents-asyncclient-4.0.x/ws/httpasyncclient-4.0.x/httpasyncclient-cache/src/test/java/org/apache/http/impl/client/cache/ClientExecChainAsyncClient.java>:[78,11]
[deprecation] org.apache.http.nio.conn.ClientAsyncConnectionManager in org.apache.http.nio.conn
has been deprecated
[WARNING] <https://builds.apache.org/job/httpcomponents-asyncclient-4.0.x/ws/httpasyncclient-4.0.x/httpasyncclient-cache/src/test/java/org/apache/http/impl/client/cache/ClientExecChainAsyncClient.java>:[83,11]
[deprecation] org.apache.http.params.HttpParams in org.apache.http.params has been deprecated
[INFO] 
[INFO] --- maven-surefire-plugin:2.15:test (default-test) @ httpasyncclient-cache ---
[INFO] Surefire report directory: <https://builds.apache.org/job/httpcomponents-asyncclient-4.0.x/ws/httpasyncclient-4.0.x/httpasyncclient-cache/target/surefire-reports>

-------------------------------------------------------
 T E S T S
-------------------------------------------------------
Running org.apache.http.impl.client.cache.TestAsyncProtocolDeviations
Tests run: 5, Failures: 0, Errors: 0, Skipped: 0, Time elapsed: 0.359 sec - in org.apache.http.impl.client.cache.TestAsyncProtocolDeviations
Running org.apache.http.impl.client.cache.TestHttpAsyncCacheJiraNumber1147
Tests run: 1, Failures: 0, Errors: 0, Skipped: 1, Time elapsed: 0 sec - in org.apache.http.impl.client.cache.TestHttpAsyncCacheJiraNumber1147
Running org.apache.http.impl.client.cache.TestAsyncProtocolAllowedBehavior
Tests run: 2, Failures: 0, Errors: 0, Skipped: 0, Time elapsed: 0.019 sec - in org.apache.http.impl.client.cache.TestAsyncProtocolAllowedBehavior
Running org.apache.http.impl.client.cache.TestAsyncProtocolRequirements
Tests run: 232, Failures: 0, Errors: 0, Skipped: 1, Time elapsed: 1.533 sec - in org.apache.http.impl.client.cache.TestAsyncProtocolRequirements
Running org.apache.http.impl.client.cache.TestCachingHttpAsyncClient
Tests run: 53, Failures: 0, Errors: 0, Skipped: 1, Time elapsed: 0.24 sec - in org.apache.http.impl.client.cache.TestCachingHttpAsyncClient

Results :

Tests run: 293, Failures: 0, Errors: 0, Skipped: 3

[JENKINS] Recording test results
[INFO] 
[INFO] --- maven-jar-plugin:2.4:jar (default-jar) @ httpasyncclient-cache ---
[INFO] Building jar: <https://builds.apache.org/job/httpcomponents-asyncclient-4.0.x/ws/httpasyncclient-4.0.x/httpasyncclient-cache/target/httpasyncclient-cache-4.0.2-SNAPSHOT.jar>
[INFO] 
[INFO] --- maven-checkstyle-plugin:2.9.1:checkstyle (validate) @ httpasyncclient-cache ---
[INFO] Starting audit...
Audit done.

[INFO] 
[INFO] --- maven-checkstyle-plugin:2.9.1:checkstyle (validate-main) @ httpasyncclient-cache
---
[INFO] Starting audit...
Audit done.

[INFO] 
[INFO] --- maven-checkstyle-plugin:2.9.1:checkstyle (validate-test) @ httpasyncclient-cache
---
[INFO] Starting audit...
Audit done.

[INFO] 
[INFO] --- maven-checkstyle-plugin:2.9.1:checkstyle (validate-examples) @ httpasyncclient-cache
---
[WARNING] Failed to getClass for org.apache.maven.plugin.source.SourceJarMojo
[INFO] 
[INFO] --- maven-source-plugin:2.2.1:jar (attach-sources) @ httpasyncclient-cache ---
[INFO] Building jar: <https://builds.apache.org/job/httpcomponents-asyncclient-4.0.x/ws/httpasyncclient-4.0.x/httpasyncclient-cache/target/httpasyncclient-cache-4.0.2-SNAPSHOT-sources.jar>
[INFO] 
[INFO] --- maven-site-plugin:3.3:attach-descriptor (attach-descriptor) @ httpasyncclient-cache
---
[INFO] 
[INFO] --- maven-install-plugin:2.4:install (default-install) @ httpasyncclient-cache ---
[INFO] Installing <https://builds.apache.org/job/httpcomponents-asyncclient-4.0.x/ws/httpasyncclient-4.0.x/httpasyncclient-cache/target/httpasyncclient-cache-4.0.2-SNAPSHOT.jar>
to /export/home/hudson/hudson-slave/maven-repositories/0/org/apache/httpcomponents/httpasyncclient-cache/4.0.2-SNAPSHOT/httpasyncclient-cache-4.0.2-SNAPSHOT.jar
[INFO] Installing <https://builds.apache.org/job/httpcomponents-asyncclient-4.0.x/ws/httpasyncclient-4.0.x/httpasyncclient-cache/pom.xml>
to /export/home/hudson/hudson-slave/maven-repositories/0/org/apache/httpcomponents/httpasyncclient-cache/4.0.2-SNAPSHOT/httpasyncclient-cache-4.0.2-SNAPSHOT.pom
[INFO] Installing <https://builds.apache.org/job/httpcomponents-asyncclient-4.0.x/ws/httpasyncclient-4.0.x/httpasyncclient-cache/target/httpasyncclient-cache-4.0.2-SNAPSHOT-sources.jar>
to /export/home/hudson/hudson-slave/maven-repositories/0/org/apache/httpcomponents/httpasyncclient-cache/4.0.2-SNAPSHOT/httpasyncclient-cache-4.0.2-SNAPSHOT-sources.jar
Build timed out (after 30 minutes). Marking the build as failed.
[INFO] ------------------------------------------------------------------------
[INFO] Reactor Summary:
[INFO] 
[INFO] Apache HttpComponents AsyncClient ................. SUCCESS [2:52.947s]
[INFO] Apache HttpAsyncClient ............................ SUCCESS [1:48.201s]
[INFO] Apache HttpAsyncClient Cache ...................... FAILURE [3:13.376s]
[INFO] HttpAsyncClient OSGi bundle ....................... SKIPPED
[INFO] ------------------------------------------------------------------------
[INFO] BUILD FAILURE
[INFO] ------------------------------------------------------------------------
[INFO] Total time: 18:47.606s
[INFO] Finished at: Fri Apr 11 19:29:39 GMT+00:00 2014
[INFO] Final Memory: 26M/224M
[INFO] ------------------------------------------------------------------------
[ERROR] Internal error: java.lang.IllegalStateException: Unable to call isArchivingDisabled.
Invalid object ID 9 -> [Help 1]
org.apache.maven.InternalErrorException: Internal error: java.lang.IllegalStateException:
Unable to call isArchivingDisabled. Invalid object ID 9
	at org.apache.maven.DefaultMaven.execute(DefaultMaven.java:168)
	at org.jvnet.hudson.maven3.launcher.Maven3Launcher.main(Maven3Launcher.java:117)
	at sun.reflect.NativeMethodAccessorImpl.invoke0(Native Method)
	at sun.reflect.NativeMethodAccessorImpl.invoke(NativeMethodAccessorImpl.java:39)
	at sun.reflect.DelegatingMethodAccessorImpl.invoke(DelegatingMethodAccessorImpl.java:25)
	at java.lang.reflect.Method.invoke(Method.java:597)
	at org.codehaus.plexus.classworlds.launcher.Launcher.launchStandard(Launcher.java:329)
	at org.codehaus.plexus.classworlds.launcher.Launcher.launch(Launcher.java:239)
	at org.jvnet.hudson.maven3.agent.Maven3Main.launch(Maven3Main.java:178)
	at sun.reflect.NativeMethodAccessorImpl.invoke0(Native Method)
	at sun.reflect.NativeMethodAccessorImpl.invoke(NativeMethodAccessorImpl.java:39)
	at sun.reflect.DelegatingMethodAccessorImpl.invoke(DelegatingMethodAccessorImpl.java:25)
	at java.lang.reflect.Method.invoke(Method.java:597)
	at hudson.maven.Maven3Builder.call(Maven3Builder.java:134)
	at hudson.maven.Maven3Builder.call(Maven3Builder.java:69)
	at hudson.remoting.UserRequest.perform(UserRequest.java:118)
	at hudson.remoting.UserRequest.perform(UserRequest.java:48)
	at hudson.remoting.Request$2.run(Request.java:328)
	at hudson.remoting.InterceptingExecutorService$1.call(InterceptingExecutorService.java:72)
	at java.util.concurrent.FutureTask$Sync.innerRun(FutureTask.java:303)
	at java.util.concurrent.FutureTask.run(FutureTask.java:138)
	at java.util.concurrent.ThreadPoolExecutor$Worker.runTask(ThreadPoolExecutor.java:886)
	at java.util.concurrent.ThreadPoolExecutor$Worker.run(ThreadPoolExecutor.java:908)
	at java.lang.Thread.run(Thread.java:662)
Caused by: java.lang.IllegalStateException: Unable to call isArchivingDisabled. Invalid object
ID 9
	at hudson.remoting.RemoteInvocationHandler$RPCRequest.perform(RemoteInvocationHandler.java:293)
	at hudson.remoting.RemoteInvocationHandler$RPCRequest.call(RemoteInvocationHandler.java:280)
	at hudson.remoting.RemoteInvocationHandler$RPCRequest.call(RemoteInvocationHandler.java:239)
	at hudson.remoting.UserRequest.perform(UserRequest.java:118)
	at hudson.remoting.UserRequest.perform(UserRequest.java:48)
	at hudson.remoting.Request$2.run(Request.java:328)
	at hudson.remoting.InterceptingExecutorService$1.call(InterceptingExecutorService.java:72)
	at jenkins.util.ContextResettingExecutorService$2.call(ContextResettingExecutorService.java:46)
	at java.util.concurrent.FutureTask.run(FutureTask.java:266)
	at java.util.concurrent.ThreadPoolExecutor.runWorker(ThreadPoolExecutor.java:1142)
	at java.util.concurrent.ThreadPoolExecutor$Worker.run(ThreadPoolExecutor.java:617)
	at java.lang.Thread.run(Thread.java:744)
[ERROR] 
[ERROR] To see the full stack trace of the errors, re-run Maven with the -e switch.
[ERROR] Re-run Maven using the -X switch to enable full debug logging.
[ERROR] 
[ERROR] For more information about the errors and possible solutions, please read the following
articles:
[ERROR] [Help 1] http://cwiki.apache.org/confluence/display/MAVEN/InternalErrorException
channel stopped

Mime
View raw message