hc-commits mailing list archives

Site index · List index
Message view « Date » · « Thread »
Top « Date » · « Thread »
From Apache Jenkins Server <jenk...@builds.apache.org>
Subject Build failed in Jenkins: httpcomponents-core-4.4.x #14
Date Wed, 26 Mar 2014 00:49:37 GMT
See <https://builds.apache.org/job/httpcomponents-core-4.4.x/14/changes>

Changes:

[olegk] HTTPCORE-376: AbstractNIOConnPool#requestCancelled() should not process pending requests
wnen being shut down
Contributed by Dmitry Potapov <potapov.d at gmail.com>

------------------------------------------
[...truncated 740 lines...]
[INFO] 
[INFO] --- maven-checkstyle-plugin:2.9.1:checkstyle (validate-main) @ httpcore-osgi ---
[INFO] Starting audit...
Audit done.

[INFO] 
[INFO] --- maven-checkstyle-plugin:2.9.1:checkstyle (validate-test) @ httpcore-osgi ---
[INFO] 
[INFO] --- maven-checkstyle-plugin:2.9.1:checkstyle (validate-examples) @ httpcore-osgi ---
[INFO] 
[INFO] --- maven-remote-resources-plugin:1.4:process (default) @ httpcore-osgi ---
[INFO] 
[INFO] --- buildnumber-maven-plugin:1.2:create (default) @ httpcore-osgi ---
[INFO] Checking for local modifications: skipped.
[INFO] Updating project files from SCM: skipped.
[INFO] Executing: /bin/sh -c cd <https://builds.apache.org/job/httpcomponents-core-4.4.x/ws/httpcore-trunk/httpcore-osgi>
&& svn --non-interactive info
[INFO] Working directory: <https://builds.apache.org/job/httpcomponents-core-4.4.x/ws/httpcore-trunk/httpcore-osgi>
[INFO] Storing buildNumber: 1557337 at timestamp: 1395794546569
[INFO] Executing: /bin/sh -c cd <https://builds.apache.org/job/httpcomponents-core-4.4.x/ws/httpcore-trunk/httpcore-osgi>
&& svn --non-interactive info
[INFO] Working directory: <https://builds.apache.org/job/httpcomponents-core-4.4.x/ws/httpcore-trunk/httpcore-osgi>
[INFO] Storing buildScmBranch: trunk
[INFO] 
[INFO] --- maven-resources-plugin:2.6:resources (default-resources) @ httpcore-osgi ---
[INFO] Using 'UTF-8' encoding to copy filtered resources.
[INFO] skip non existing resourceDirectory <https://builds.apache.org/job/httpcomponents-core-4.4.x/ws/httpcore-trunk/httpcore-osgi/src/main/resources>
[INFO] Copying 3 resources
[INFO] Copying 3 resources
[INFO] 
[INFO] --- maven-compiler-plugin:3.1:compile (default-compile) @ httpcore-osgi ---
[INFO] No sources to compile
[WARNING] Failed to getClass for org.codehaus.mojo.clirr.ClirrCheckMojo
[INFO] 
[INFO] --- clirr-maven-plugin:2.5:check (default-cli) @ httpcore-osgi ---
[INFO] Skipping execution
[INFO]                                                                         
[INFO] ------------------------------------------------------------------------
[INFO] Building Apache HttpCore Benchmarking Tool 4.4-alpha1-SNAPSHOT
[INFO] ------------------------------------------------------------------------
[INFO] 
[INFO] --- maven-clean-plugin:2.5:clean (default-clean) @ httpcore-ab ---
[INFO] 
[INFO] --- maven-checkstyle-plugin:2.9.1:checkstyle (validate) @ httpcore-ab ---
[INFO] Starting audit...
Audit done.

[INFO] 
[INFO] --- maven-checkstyle-plugin:2.9.1:checkstyle (validate-main) @ httpcore-ab ---
[INFO] Starting audit...
Audit done.

[INFO] 
[INFO] --- maven-checkstyle-plugin:2.9.1:checkstyle (validate-test) @ httpcore-ab ---
[INFO] Starting audit...
Audit done.

[INFO] 
[INFO] --- maven-checkstyle-plugin:2.9.1:checkstyle (validate-examples) @ httpcore-ab ---
[INFO] 
[INFO] --- maven-remote-resources-plugin:1.4:process (default) @ httpcore-ab ---
[INFO] 
[INFO] --- buildnumber-maven-plugin:1.2:create (default) @ httpcore-ab ---
[INFO] Checking for local modifications: skipped.
[INFO] Updating project files from SCM: skipped.
[INFO] Executing: /bin/sh -c cd <https://builds.apache.org/job/httpcomponents-core-4.4.x/ws/httpcore-trunk/httpcore-ab>
&& svn --non-interactive info
[INFO] Working directory: <https://builds.apache.org/job/httpcomponents-core-4.4.x/ws/httpcore-trunk/httpcore-ab>
[INFO] Storing buildNumber: 1558078 at timestamp: 1395794861881
[INFO] Executing: /bin/sh -c cd <https://builds.apache.org/job/httpcomponents-core-4.4.x/ws/httpcore-trunk/httpcore-ab>
&& svn --non-interactive info
[INFO] Working directory: <https://builds.apache.org/job/httpcomponents-core-4.4.x/ws/httpcore-trunk/httpcore-ab>
[INFO] Storing buildScmBranch: trunk
[INFO] 
[INFO] --- maven-resources-plugin:2.6:resources (default-resources) @ httpcore-ab ---
[INFO] Using 'UTF-8' encoding to copy filtered resources.
[INFO] skip non existing resourceDirectory <https://builds.apache.org/job/httpcomponents-core-4.4.x/ws/httpcore-trunk/httpcore-ab/src/main/resources>
[INFO] Copying 3 resources
[INFO] 
[INFO] --- maven-compiler-plugin:3.1:compile (default-compile) @ httpcore-ab ---
[INFO] Changes detected - recompiling the module!
[INFO] Compiling 12 source files to <https://builds.apache.org/job/httpcomponents-core-4.4.x/ws/httpcore-trunk/httpcore-ab/target/classes>
[INFO] 
[INFO] --- maven-resources-plugin:2.6:testResources (default-testResources) @ httpcore-ab
---
[INFO] Using 'UTF-8' encoding to copy filtered resources.
[INFO] skip non existing resourceDirectory <https://builds.apache.org/job/httpcomponents-core-4.4.x/ws/httpcore-trunk/httpcore-ab/src/test/resources>
[INFO] Copying 3 resources
[INFO] 
[INFO] --- maven-compiler-plugin:3.1:testCompile (default-testCompile) @ httpcore-ab ---
[INFO] Changes detected - recompiling the module!
[INFO] Compiling 2 source files to <https://builds.apache.org/job/httpcomponents-core-4.4.x/ws/httpcore-trunk/httpcore-ab/target/test-classes>
[INFO] 
[INFO] --- maven-surefire-plugin:2.15:test (default-test) @ httpcore-ab ---
[INFO] Surefire report directory: <https://builds.apache.org/job/httpcomponents-core-4.4.x/ws/httpcore-trunk/httpcore-ab/target/surefire-reports>

-------------------------------------------------------
 T E S T S
-------------------------------------------------------
Running org.apache.http.benchmark.SmokeTest
Tests run: 1, Failures: 0, Errors: 0, Skipped: 0, Time elapsed: 1.117 sec - in org.apache.http.benchmark.SmokeTest

Results :

Tests run: 1, Failures: 0, Errors: 0, Skipped: 0

[JENKINS] Recording test results
[INFO] 
[INFO] --- maven-jar-plugin:2.4:jar (default-jar) @ httpcore-ab ---
[INFO] Building jar: <https://builds.apache.org/job/httpcomponents-core-4.4.x/ws/httpcore-trunk/httpcore-ab/target/httpcore-ab-4.4-alpha1-SNAPSHOT.jar>
[INFO] 
[INFO] --- maven-checkstyle-plugin:2.9.1:checkstyle (validate) @ httpcore-ab ---
[INFO] Starting audit...
Audit done.

[INFO] 
[INFO] --- maven-checkstyle-plugin:2.9.1:checkstyle (validate-main) @ httpcore-ab ---
[INFO] Starting audit...
Audit done.

[INFO] 
[INFO] --- maven-checkstyle-plugin:2.9.1:checkstyle (validate-test) @ httpcore-ab ---
[INFO] Starting audit...
Audit done.

[INFO] 
[INFO] --- maven-checkstyle-plugin:2.9.1:checkstyle (validate-examples) @ httpcore-ab ---
[WARNING] Failed to getClass for org.apache.maven.plugin.source.SourceJarMojo
[INFO] 
[INFO] --- maven-source-plugin:2.2.1:jar (attach-sources) @ httpcore-ab ---
[INFO] Building jar: <https://builds.apache.org/job/httpcomponents-core-4.4.x/ws/httpcore-trunk/httpcore-ab/target/httpcore-ab-4.4-alpha1-SNAPSHOT-sources.jar>
[INFO] 
[INFO] --- maven-javadoc-plugin:2.9.1:jar (attach-javadocs) @ httpcore-ab ---
[INFO] Fixed Javadoc frame injection vulnerability (CVE-2013-1571) in 1 files.
[INFO] Building jar: <https://builds.apache.org/job/httpcomponents-core-4.4.x/ws/httpcore-trunk/httpcore-ab/target/httpcore-ab-4.4-alpha1-SNAPSHOT-javadoc.jar>
[INFO] 
[INFO] --- maven-site-plugin:3.3:attach-descriptor (attach-descriptor) @ httpcore-ab ---
[INFO] 
[INFO] --- maven-install-plugin:2.4:install (default-install) @ httpcore-ab ---
[INFO] Installing <https://builds.apache.org/job/httpcomponents-core-4.4.x/ws/httpcore-trunk/httpcore-ab/target/httpcore-ab-4.4-alpha1-SNAPSHOT.jar>
to /export/home/hudson/hudson-slave/maven-repositories/1/org/apache/httpcomponents/httpcore-ab/4.4-alpha1-SNAPSHOT/httpcore-ab-4.4-alpha1-SNAPSHOT.jar
[INFO] Installing <https://builds.apache.org/job/httpcomponents-core-4.4.x/ws/httpcore-trunk/httpcore-ab/pom.xml>
to /export/home/hudson/hudson-slave/maven-repositories/1/org/apache/httpcomponents/httpcore-ab/4.4-alpha1-SNAPSHOT/httpcore-ab-4.4-alpha1-SNAPSHOT.pom
[INFO] Installing <https://builds.apache.org/job/httpcomponents-core-4.4.x/ws/httpcore-trunk/httpcore-ab/target/httpcore-ab-4.4-alpha1-SNAPSHOT-sources.jar>
to /export/home/hudson/hudson-slave/maven-repositories/1/org/apache/httpcomponents/httpcore-ab/4.4-alpha1-SNAPSHOT/httpcore-ab-4.4-alpha1-SNAPSHOT-sources.jar
[INFO] Installing <https://builds.apache.org/job/httpcomponents-core-4.4.x/ws/httpcore-trunk/httpcore-ab/target/httpcore-ab-4.4-alpha1-SNAPSHOT-javadoc.jar>
to /export/home/hudson/hudson-slave/maven-repositories/1/org/apache/httpcomponents/httpcore-ab/4.4-alpha1-SNAPSHOT/httpcore-ab-4.4-alpha1-SNAPSHOT-javadoc.jar
[INFO] 
[INFO] --- maven-checkstyle-plugin:2.9.1:checkstyle (validate) @ httpcore-ab ---
[INFO] Starting audit...
Audit done.

[INFO] 
[INFO] --- maven-checkstyle-plugin:2.9.1:checkstyle (validate-main) @ httpcore-ab ---
[INFO] Starting audit...
Audit done.

[INFO] 
[INFO] --- maven-checkstyle-plugin:2.9.1:checkstyle (validate-test) @ httpcore-ab ---
[INFO] Starting audit...
Audit done.

[INFO] 
[INFO] --- maven-checkstyle-plugin:2.9.1:checkstyle (validate-examples) @ httpcore-ab ---
[INFO] 
[INFO] --- maven-remote-resources-plugin:1.4:process (default) @ httpcore-ab ---
[INFO] 
[INFO] --- buildnumber-maven-plugin:1.2:create (default) @ httpcore-ab ---
[INFO] Checking for local modifications: skipped.
[INFO] Updating project files from SCM: skipped.
[INFO] Executing: /bin/sh -c cd <https://builds.apache.org/job/httpcomponents-core-4.4.x/ws/httpcore-trunk/httpcore-ab>
&& svn --non-interactive info
[INFO] Working directory: <https://builds.apache.org/job/httpcomponents-core-4.4.x/ws/httpcore-trunk/httpcore-ab>
[INFO] Storing buildNumber: 1558078 at timestamp: 1395794891404
[INFO] Executing: /bin/sh -c cd <https://builds.apache.org/job/httpcomponents-core-4.4.x/ws/httpcore-trunk/httpcore-ab>
&& svn --non-interactive info
[INFO] Working directory: <https://builds.apache.org/job/httpcomponents-core-4.4.x/ws/httpcore-trunk/httpcore-ab>
[INFO] Storing buildScmBranch: trunk
[INFO] 
[INFO] --- maven-resources-plugin:2.6:resources (default-resources) @ httpcore-ab ---
[INFO] Using 'UTF-8' encoding to copy filtered resources.
[INFO] skip non existing resourceDirectory <https://builds.apache.org/job/httpcomponents-core-4.4.x/ws/httpcore-trunk/httpcore-ab/src/main/resources>
[INFO] Copying 3 resources
[INFO] Copying 3 resources
[INFO] 
[INFO] --- maven-compiler-plugin:3.1:compile (default-compile) @ httpcore-ab ---
[INFO] Changes detected - recompiling the module!
[INFO] Compiling 12 source files to <https://builds.apache.org/job/httpcomponents-core-4.4.x/ws/httpcore-trunk/httpcore-ab/target/classes>
[WARNING] Failed to getClass for org.codehaus.mojo.clirr.ClirrCheckMojo
[INFO] 
[INFO] --- clirr-maven-plugin:2.5:check (default-cli) @ httpcore-ab ---
[INFO] Comparing to version: 4.3
[INFO] Succeeded with 0 errors; 0 warnings; and 0 other changes.
Build timed out (after 30 minutes). Marking the build as failed.
[INFO] ------------------------------------------------------------------------
[INFO] Reactor Summary:
[INFO] 
[INFO] Apache HttpComponents Core ........................ SUCCESS [2:00.114s]
[INFO] Apache HttpCore ................................... SUCCESS [2:02.464s]
[INFO] Apache HttpCore NIO ............................... SUCCESS [1:27.243s]
[INFO] Apache HttpCore OSGi bundle ....................... SUCCESS [1:06.092s]
[INFO] Apache HttpCore Benchmarking Tool ................. FAILURE [1:42.692s]
[INFO] ------------------------------------------------------------------------
[INFO] BUILD FAILURE
[INFO] ------------------------------------------------------------------------
[INFO] Total time: 29:01.332s
[INFO] Finished at: Wed Mar 26 00:49:20 GMT+00:00 2014
[INFO] Final Memory: 45M/282M
[INFO] ------------------------------------------------------------------------
[ERROR] Internal error: java.lang.IllegalStateException: Unable to call isArchivingDisabled.
Invalid object ID 7 -> [Help 1]
org.apache.maven.InternalErrorException: Internal error: java.lang.IllegalStateException:
Unable to call isArchivingDisabled. Invalid object ID 7
	at org.apache.maven.DefaultMaven.execute(DefaultMaven.java:168)
	at org.jvnet.hudson.maven3.launcher.Maven3Launcher.main(Maven3Launcher.java:117)
	at sun.reflect.NativeMethodAccessorImpl.invoke0(Native Method)
	at sun.reflect.NativeMethodAccessorImpl.invoke(NativeMethodAccessorImpl.java:39)
	at sun.reflect.DelegatingMethodAccessorImpl.invoke(DelegatingMethodAccessorImpl.java:25)
	at java.lang.reflect.Method.invoke(Method.java:597)
	at org.codehaus.plexus.classworlds.launcher.Launcher.launchStandard(Launcher.java:329)
	at org.codehaus.plexus.classworlds.launcher.Launcher.launch(Launcher.java:239)
	at org.jvnet.hudson.maven3.agent.Maven3Main.launch(Maven3Main.java:178)
	at sun.reflect.NativeMethodAccessorImpl.invoke0(Native Method)
	at sun.reflect.NativeMethodAccessorImpl.invoke(NativeMethodAccessorImpl.java:39)
	at sun.reflect.DelegatingMethodAccessorImpl.invoke(DelegatingMethodAccessorImpl.java:25)
	at java.lang.reflect.Method.invoke(Method.java:597)
	at hudson.maven.Maven3Builder.call(Maven3Builder.java:134)
	at hudson.maven.Maven3Builder.call(Maven3Builder.java:69)
	at hudson.remoting.UserRequest.perform(UserRequest.java:118)
	at hudson.remoting.UserRequest.perform(UserRequest.java:48)
	at hudson.remoting.Request$2.run(Request.java:328)
	at hudson.remoting.InterceptingExecutorService$1.call(InterceptingExecutorService.java:72)
	at java.util.concurrent.FutureTask$Sync.innerRun(FutureTask.java:303)
	at java.util.concurrent.FutureTask.run(FutureTask.java:138)
	at java.util.concurrent.ThreadPoolExecutor$Worker.runTask(ThreadPoolExecutor.java:886)
	at java.util.concurrent.ThreadPoolExecutor$Worker.run(ThreadPoolExecutor.java:908)
	at java.lang.Thread.run(Thread.java:662)
Caused by: java.lang.IllegalStateException: Unable to call isArchivingDisabled. Invalid object
ID 7
	at hudson.remoting.RemoteInvocationHandler$RPCRequest.perform(RemoteInvocationHandler.java:293)
	at hudson.remoting.RemoteInvocationHandler$RPCRequest.call(RemoteInvocationHandler.java:280)
	at hudson.remoting.RemoteInvocationHandler$RPCRequest.call(RemoteInvocationHandler.java:239)
	at hudson.remoting.UserRequest.perform(UserRequest.java:118)
	at hudson.remoting.UserRequest.perform(UserRequest.java:48)
	at hudson.remoting.Request$2.run(Request.java:328)
	at hudson.remoting.InterceptingExecutorService$1.call(InterceptingExecutorService.java:72)
	at jenkins.util.ContextResettingExecutorService$2.call(ContextResettingExecutorService.java:46)
	at java.util.concurrent.FutureTask.run(FutureTask.java:262)
	at java.util.concurrent.ThreadPoolExecutor.runWorker(ThreadPoolExecutor.java:1145)
	at java.util.concurrent.ThreadPoolExecutor$Worker.run(ThreadPoolExecutor.java:615)
	at java.lang.Thread.run(Thread.java:744)
[ERROR] 
[ERROR] To see the full stack trace of the errors, re-run Maven with the -e switch.
[ERROR] Re-run Maven using the -X switch to enable full debug logging.
[ERROR] 
[ERROR] For more information about the errors and possible solutions, please read the following
articles:
[ERROR] [Help 1] http://cwiki.apache.org/confluence/display/MAVEN/InternalErrorException
Sending e-mails to: commits@hc.apache.org
Sending e-mails to: commits@hc.apache.org
Sending e-mails to: commits@hc.apache.org
Sending e-mails to: commits@hc.apache.org
Sending e-mails to: commits@hc.apache.org
channel stopped

Mime
View raw message