hc-commits mailing list archives

Site index · List index
Message view « Date » · « Thread »
Top « Date » · « Thread »
From Apache Jenkins Server <jenk...@builds.apache.org>
Subject Build failed in Jenkins: httpcomponents-core-4.3.x #556
Date Sat, 11 Jan 2014 10:33:34 GMT
See <https://builds.apache.org/job/httpcomponents-core-4.3.x/556/>

------------------------------------------
[...truncated 443 lines...]
[INFO] Updating project files from SCM: skipped.
[INFO] Executing: cmd.exe /X /C "svn --non-interactive info"
[INFO] Working directory: F:\jenkins\jenkins-slave\workspace\httpcomponents-core-4.3.x\httpcore-trunk\httpcore-nio
[INFO] Storing buildNumber: 1557060 at timestamp: 1389436348585
[INFO] Executing: cmd.exe /X /C "svn --non-interactive info"
[INFO] Working directory: F:\jenkins\jenkins-slave\workspace\httpcomponents-core-4.3.x\httpcore-trunk\httpcore-nio
[INFO] Storing buildScmBranch: branches/4.3.x/httpcore-nio
[INFO] 
[INFO] --- maven-resources-plugin:2.6:resources (default-resources) @ httpcore-nio ---
[INFO] Using 'UTF-8' encoding to copy filtered resources.
[INFO] Copying 1 resource
[INFO] Copying 3 resources
[INFO] 
[INFO] --- maven-compiler-plugin:3.1:compile (default-compile) @ httpcore-nio ---
[INFO] Changes detected - recompiling the module!
[INFO] Compiling 201 source files to F:\jenkins\jenkins-slave\workspace\httpcomponents-core-4.3.x\httpcore-trunk\httpcore-nio\target\classes
[INFO] 
[INFO] --- maven-resources-plugin:2.6:testResources (default-testResources) @ httpcore-nio
---
[INFO] Using 'UTF-8' encoding to copy filtered resources.
[INFO] Copying 1 resource
[INFO] Copying 3 resources
[INFO] 
[INFO] --- maven-compiler-plugin:3.1:testCompile (default-testCompile) @ httpcore-nio ---
[INFO] Changes detected - recompiling the module!
[INFO] Compiling 61 source files to F:\jenkins\jenkins-slave\workspace\httpcomponents-core-4.3.x\httpcore-trunk\httpcore-nio\target\test-classes
[INFO] 
[INFO] --- maven-surefire-plugin:2.15:test (default-test) @ httpcore-nio ---
[INFO] Surefire report directory: F:\jenkins\jenkins-slave\workspace\httpcomponents-core-4.3.x\httpcore-trunk\httpcore-nio\target\surefire-reports

-------------------------------------------------------
 T E S T S
-------------------------------------------------------
Running org.apache.http.impl.nio.codecs.TestChunkDecoder
Tests run: 14, Failures: 0, Errors: 0, Skipped: 0, Time elapsed: 0.038 sec - in org.apache.http.impl.nio.codecs.TestChunkDecoder
Running org.apache.http.impl.nio.codecs.TestChunkEncoder
Tests run: 8, Failures: 0, Errors: 0, Skipped: 0, Time elapsed: 0.384 sec - in org.apache.http.impl.nio.codecs.TestChunkEncoder
Running org.apache.http.impl.nio.codecs.TestHttpMessageParser
Tests run: 17, Failures: 0, Errors: 0, Skipped: 0, Time elapsed: 0.067 sec - in org.apache.http.impl.nio.codecs.TestHttpMessageParser
Running org.apache.http.impl.nio.codecs.TestIdentityDecoder
Tests run: 8, Failures: 0, Errors: 0, Skipped: 0, Time elapsed: 0.372 sec - in org.apache.http.impl.nio.codecs.TestIdentityDecoder
Running org.apache.http.impl.nio.codecs.TestIdentityEncoder
Tests run: 20, Failures: 0, Errors: 0, Skipped: 0, Time elapsed: 0 sec - in org.apache.http.impl.nio.codecs.TestIdentityEncoder
Running org.apache.http.impl.nio.codecs.TestLengthDelimitedDecoder
Tests run: 15, Failures: 0, Errors: 0, Skipped: 0, Time elapsed: 0.23 sec - in org.apache.http.impl.nio.codecs.TestLengthDelimitedDecoder
Running org.apache.http.impl.nio.codecs.TestLengthDelimitedEncoder
Tests run: 23, Failures: 0, Errors: 0, Skipped: 0, Time elapsed: 0.001 sec - in org.apache.http.impl.nio.codecs.TestLengthDelimitedEncoder
Running org.apache.http.impl.nio.pool.TestBasicNIOConnPool
Tests run: 4, Failures: 0, Errors: 0, Skipped: 0, Time elapsed: 2.632 sec - in org.apache.http.impl.nio.pool.TestBasicNIOConnPool
Running org.apache.http.impl.nio.reactor.ExceptionEventTest
Tests run: 3, Failures: 0, Errors: 0, Skipped: 0, Time elapsed: 0 sec - in org.apache.http.impl.nio.reactor.ExceptionEventTest
Running org.apache.http.impl.nio.reactor.TestDefaultIOReactors
Tests run: 4, Failures: 0, Errors: 0, Skipped: 0, Time elapsed: 3.198 sec - in org.apache.http.impl.nio.reactor.TestDefaultIOReactors
Running org.apache.http.impl.nio.reactor.TestDefaultIOReactorsSSL
Tests run: 4, Failures: 0, Errors: 0, Skipped: 0, Time elapsed: 4.442 sec - in org.apache.http.impl.nio.reactor.TestDefaultIOReactorsSSL
Running org.apache.http.impl.nio.reactor.TestDefaultListeningIOReactor
Tests run: 3, Failures: 0, Errors: 0, Skipped: 0, Time elapsed: 0.525 sec - in org.apache.http.impl.nio.reactor.TestDefaultListeningIOReactor
Running org.apache.http.impl.nio.reactor.TestSessionInOutBuffers
Tests run: 38, Failures: 0, Errors: 0, Skipped: 0, Time elapsed: 0.314 sec - in org.apache.http.impl.nio.reactor.TestSessionInOutBuffers
Running org.apache.http.impl.nio.TestContentChannel
Tests run: 2, Failures: 0, Errors: 0, Skipped: 0, Time elapsed: 0.243 sec - in org.apache.http.impl.nio.TestContentChannel
Running org.apache.http.impl.nio.TestDefaultNHttpClientConnection
Tests run: 17, Failures: 0, Errors: 0, Skipped: 0, Time elapsed: 0.225 sec - in org.apache.http.impl.nio.TestDefaultNHttpClientConnection
Running org.apache.http.impl.nio.TestDefaultNHttpServerConnection
Tests run: 17, Failures: 0, Errors: 0, Skipped: 0, Time elapsed: 0.193 sec - in org.apache.http.impl.nio.TestDefaultNHttpServerConnection
Running org.apache.http.impl.nio.TestNHttpConnectionBase
Tests run: 14, Failures: 0, Errors: 0, Skipped: 0, Time elapsed: 0.001 sec - in org.apache.http.impl.nio.TestNHttpConnectionBase
Running org.apache.http.nio.integration.TestCustomSSL
Tests run: 1, Failures: 0, Errors: 0, Skipped: 0, Time elapsed: 0.045 sec - in org.apache.http.nio.integration.TestCustomSSL
Running org.apache.http.nio.integration.TestHttpAsyncHandlerCancellable
Tests run: 2, Failures: 0, Errors: 0, Skipped: 0, Time elapsed: 0.517 sec - in org.apache.http.nio.integration.TestHttpAsyncHandlerCancellable
Running org.apache.http.nio.integration.TestHttpAsyncHandlers
Tests run: 15, Failures: 0, Errors: 0, Skipped: 0, Time elapsed: 2.845 sec - in org.apache.http.nio.integration.TestHttpAsyncHandlers
Running org.apache.http.nio.integration.TestHttpAsyncPrematureTermination
Tests run: 3, Failures: 0, Errors: 0, Skipped: 0, Time elapsed: 0.106 sec - in org.apache.http.nio.integration.TestHttpAsyncPrematureTermination
Running org.apache.http.nio.integration.TestHttpsAsyncHandlers
Tests run: 15, Failures: 0, Errors: 0, Skipped: 0, Time elapsed: 4.595 sec - in org.apache.http.nio.integration.TestHttpsAsyncHandlers
Running org.apache.http.nio.integration.TestHttpsAsyncTimeout
Tests run: 1, Failures: 0, Errors: 0, Skipped: 0, Time elapsed: 2.01 sec - in org.apache.http.nio.integration.TestHttpsAsyncTimeout
Running org.apache.http.nio.integration.TestPipelining
Tests run: 2, Failures: 0, Errors: 0, Skipped: 0, Time elapsed: 0.022 sec - in org.apache.http.nio.integration.TestPipelining
Running org.apache.http.nio.integration.TestTruncatedChunks
Tests run: 2, Failures: 0, Errors: 0, Skipped: 0, Time elapsed: 0.161 sec - in org.apache.http.nio.integration.TestTruncatedChunks
Running org.apache.http.nio.pool.TestNIOConnPool
Tests run: 22, Failures: 0, Errors: 0, Skipped: 0, Time elapsed: 0.723 sec - in org.apache.http.nio.pool.TestNIOConnPool
Running org.apache.http.nio.pool.TestRouteSpecificPool
Tests run: 13, Failures: 0, Errors: 0, Skipped: 0, Time elapsed: 0.027 sec - in org.apache.http.nio.pool.TestRouteSpecificPool
Running org.apache.http.nio.protocol.TestBasicAsyncClientExchangeHandler
Tests run: 19, Failures: 0, Errors: 0, Skipped: 0, Time elapsed: 0.302 sec - in org.apache.http.nio.protocol.TestBasicAsyncClientExchangeHandler
Running org.apache.http.nio.protocol.TestBasicAsyncRequestConsumer
Tests run: 3, Failures: 0, Errors: 0, Skipped: 0, Time elapsed: 0.104 sec - in org.apache.http.nio.protocol.TestBasicAsyncRequestConsumer
Running org.apache.http.nio.protocol.TestBasicAsyncRequestHandler
Tests run: 3, Failures: 0, Errors: 0, Skipped: 0, Time elapsed: 0.15 sec - in org.apache.http.nio.protocol.TestBasicAsyncRequestHandler
Running org.apache.http.nio.protocol.TestBasicAsyncRequestProducer
Tests run: 10, Failures: 0, Errors: 0, Skipped: 0, Time elapsed: 0.001 sec - in org.apache.http.nio.protocol.TestBasicAsyncRequestProducer
Running org.apache.http.nio.protocol.TestBasicAsyncResponseConsumer
Tests run: 6, Failures: 0, Errors: 0, Skipped: 0, Time elapsed: 0 sec - in org.apache.http.nio.protocol.TestBasicAsyncResponseConsumer
Running org.apache.http.nio.protocol.TestBasicAsyncResponseProducer
Tests run: 5, Failures: 0, Errors: 0, Skipped: 0, Time elapsed: 0 sec - in org.apache.http.nio.protocol.TestBasicAsyncResponseProducer
Running org.apache.http.nio.protocol.TestErrorResponseProducer
Tests run: 2, Failures: 0, Errors: 0, Skipped: 0, Time elapsed: 0 sec - in org.apache.http.nio.protocol.TestErrorResponseProducer
Running org.apache.http.nio.protocol.TestHttpAsyncRequester
Tests run: 9, Failures: 0, Errors: 0, Skipped: 0, Time elapsed: 0.001 sec - in org.apache.http.nio.protocol.TestHttpAsyncRequester
Running org.apache.http.nio.protocol.TestHttpAsyncRequestExecutor
Tests run: 35, Failures: 0, Errors: 0, Skipped: 0, Time elapsed: 0.002 sec - in org.apache.http.nio.protocol.TestHttpAsyncRequestExecutor
Running org.apache.http.nio.protocol.TestHttpAsyncService
Tests run: 37, Failures: 0, Errors: 0, Skipped: 0, Time elapsed: 0.001 sec - in org.apache.http.nio.protocol.TestHttpAsyncService
Running org.apache.http.nio.protocol.TestUriHttpAsyncRequestHandlerMapper
Tests run: 5, Failures: 0, Errors: 0, Skipped: 0, Time elapsed: 0 sec - in org.apache.http.nio.protocol.TestUriHttpAsyncRequestHandlerMapper
Running org.apache.http.nio.util.TestBuffers
Tests run: 7, Failures: 0, Errors: 0, Skipped: 0, Time elapsed: 0.001 sec - in org.apache.http.nio.util.TestBuffers

Results :

Tests run: 428, Failures: 0, Errors: 0, Skipped: 0

[JENKINS] Recording test results
[INFO] 
[INFO] --- maven-jar-plugin:2.4:jar (default-jar) @ httpcore-nio ---
[INFO] Building jar: F:\jenkins\jenkins-slave\workspace\httpcomponents-core-4.3.x\httpcore-trunk\httpcore-nio\target\httpcore-nio-4.3.2-SNAPSHOT.jar
[INFO] 
[INFO] --- maven-checkstyle-plugin:2.9.1:checkstyle (validate) @ httpcore-nio ---
[INFO] Starting audit...
Audit done.

[INFO] 
[INFO] --- maven-checkstyle-plugin:2.9.1:checkstyle (validate-main) @ httpcore-nio ---
[INFO] Starting audit...
Audit done.

[INFO] 
[INFO] --- maven-checkstyle-plugin:2.9.1:checkstyle (validate-test) @ httpcore-nio ---
[INFO] Starting audit...
Audit done.

[INFO] 
[INFO] --- maven-checkstyle-plugin:2.9.1:checkstyle (validate-examples) @ httpcore-nio ---
[INFO] Starting audit...
Audit done.

[INFO] 
[INFO] --- build-helper-maven-plugin:1.8:add-source (add-source) @ httpcore-nio ---
[INFO] Source directory: F:\jenkins\jenkins-slave\workspace\httpcomponents-core-4.3.x\httpcore-trunk\httpcore-nio\src\main\java-deprecated
added.
[WARNING] Failed to getClass for org.apache.maven.plugin.source.SourceJarMojo
[INFO] 
[INFO] --- maven-source-plugin:2.2.1:jar (attach-sources) @ httpcore-nio ---
[INFO] Building jar: F:\jenkins\jenkins-slave\workspace\httpcomponents-core-4.3.x\httpcore-trunk\httpcore-nio\target\httpcore-nio-4.3.2-SNAPSHOT-sources.jar
[INFO] 
[INFO] --- maven-javadoc-plugin:2.9.1:jar (attach-javadocs) @ httpcore-nio ---
[INFO] Fixed Javadoc frame injection vulnerability (CVE-2013-1571) in 1 files.
[INFO] Building jar: F:\jenkins\jenkins-slave\workspace\httpcomponents-core-4.3.x\httpcore-trunk\httpcore-nio\target\httpcore-nio-4.3.2-SNAPSHOT-javadoc.jar
[INFO] 
[INFO] --- maven-site-plugin:3.3:attach-descriptor (attach-descriptor) @ httpcore-nio ---
[INFO] 
[INFO] --- maven-install-plugin:2.4:install (default-install) @ httpcore-nio ---
[INFO] Installing F:\jenkins\jenkins-slave\workspace\httpcomponents-core-4.3.x\httpcore-trunk\httpcore-nio\target\httpcore-nio-4.3.2-SNAPSHOT.jar
to f:\jenkins\jenkins-slave\maven-repositories\0\org\apache\httpcomponents\httpcore-nio\4.3.2-SNAPSHOT\httpcore-nio-4.3.2-SNAPSHOT.jar
[INFO] Installing F:\jenkins\jenkins-slave\workspace\httpcomponents-core-4.3.x\httpcore-trunk\httpcore-nio\pom.xml
to f:\jenkins\jenkins-slave\maven-repositories\0\org\apache\httpcomponents\httpcore-nio\4.3.2-SNAPSHOT\httpcore-nio-4.3.2-SNAPSHOT.pom
[INFO] Installing F:\jenkins\jenkins-slave\workspace\httpcomponents-core-4.3.x\httpcore-trunk\httpcore-nio\target\httpcore-nio-4.3.2-SNAPSHOT-sources.jar
to f:\jenkins\jenkins-slave\maven-repositories\0\org\apache\httpcomponents\httpcore-nio\4.3.2-SNAPSHOT\httpcore-nio-4.3.2-SNAPSHOT-sources.jar
[INFO] Installing F:\jenkins\jenkins-slave\workspace\httpcomponents-core-4.3.x\httpcore-trunk\httpcore-nio\target\httpcore-nio-4.3.2-SNAPSHOT-javadoc.jar
to f:\jenkins\jenkins-slave\maven-repositories\0\org\apache\httpcomponents\httpcore-nio\4.3.2-SNAPSHOT\httpcore-nio-4.3.2-SNAPSHOT-javadoc.jar
[INFO] 
[INFO] --- maven-checkstyle-plugin:2.9.1:checkstyle (validate) @ httpcore-nio ---
[INFO] Starting audit...
Audit done.

[INFO] 
[INFO] --- maven-checkstyle-plugin:2.9.1:checkstyle (validate-main) @ httpcore-nio ---
[INFO] Starting audit...
Audit done.

[INFO] 
[INFO] --- maven-checkstyle-plugin:2.9.1:checkstyle (validate-test) @ httpcore-nio ---
[INFO] Starting audit...
Audit done.

[INFO] 
[INFO] --- maven-checkstyle-plugin:2.9.1:checkstyle (validate-examples) @ httpcore-nio ---
[INFO] Starting audit...
Audit done.

[INFO] 
[INFO] --- build-helper-maven-plugin:1.8:add-source (add-source) @ httpcore-nio ---
[INFO] Source directory: F:\jenkins\jenkins-slave\workspace\httpcomponents-core-4.3.x\httpcore-trunk\httpcore-nio\src\main\java-deprecated
added.
[INFO] 
[INFO] --- maven-remote-resources-plugin:1.4:process (default) @ httpcore-nio ---
[INFO] 
[INFO] --- buildnumber-maven-plugin:1.2:create (default) @ httpcore-nio ---
[INFO] Checking for local modifications: skipped.
[INFO] Updating project files from SCM: skipped.
[INFO] Executing: cmd.exe /X /C "svn --non-interactive info"
[INFO] Working directory: F:\jenkins\jenkins-slave\workspace\httpcomponents-core-4.3.x\httpcore-trunk\httpcore-nio
[INFO] Storing buildNumber: 1557060 at timestamp: 1389436399508
[INFO] Executing: cmd.exe /X /C "svn --non-interactive info"
[INFO] Working directory: F:\jenkins\jenkins-slave\workspace\httpcomponents-core-4.3.x\httpcore-trunk\httpcore-nio
[INFO] Storing buildScmBranch: branches/4.3.x/httpcore-nio
[INFO] 
[INFO] --- maven-resources-plugin:2.6:resources (default-resources) @ httpcore-nio ---
[INFO] Using 'UTF-8' encoding to copy filtered resources.
[INFO] Copying 1 resource
[INFO] Copying 3 resources
[INFO] Copying 3 resources
[INFO] 
[INFO] --- maven-compiler-plugin:3.1:compile (default-compile) @ httpcore-nio ---
[INFO] Changes detected - recompiling the module!
[INFO] Compiling 201 source files to F:\jenkins\jenkins-slave\workspace\httpcomponents-core-4.3.x\httpcore-trunk\httpcore-nio\target\classes
[WARNING] Failed to getClass for org.codehaus.mojo.clirr.ClirrCheckMojo
[INFO] 
[INFO] --- clirr-maven-plugin:2.5:check (default-cli) @ httpcore-nio ---
[INFO] Comparing to version: 4.3
[ERROR] org.apache.http.impl.nio.reactor.SSLMode: Method 'public org.apache.http.impl.nio.reactor.SSLMode[]
values()' is now final
[ERROR] org.apache.http.nio.reactor.IOReactorStatus: Method 'public org.apache.http.nio.reactor.IOReactorStatus[]
values()' is now final
[ERROR] org.apache.http.nio.reactor.ssl.SSLMode: Method 'public org.apache.http.nio.reactor.ssl.SSLMode[]
values()' is now final
[INFO] ------------------------------------------------------------------------
[INFO] Reactor Summary:
[INFO] 
[INFO] Apache HttpComponents Core ........................ SUCCESS [15.527s]
[INFO] Apache HttpCore ................................... SUCCESS [1:00.544s]
[INFO] Apache HttpCore NIO ............................... FAILURE [1:02.776s]
[INFO] Apache HttpCore OSGi bundle ....................... SKIPPED
[INFO] Apache HttpCore Benchmarking Tool ................. SKIPPED
[INFO] ------------------------------------------------------------------------
[INFO] BUILD FAILURE
[INFO] ------------------------------------------------------------------------
[INFO] Total time: 2:25.990s
[INFO] Finished at: Sat Jan 11 02:33:24 PST 2014
[INFO] Final Memory: 33M/79M
[INFO] ------------------------------------------------------------------------
Waiting for Jenkins to finish collecting data
[ERROR] Failed to execute goal org.codehaus.mojo:clirr-maven-plugin:2.5:check (default-cli)
on project httpcore-nio: There were 3 errors. -> [Help 1]
[ERROR] 
[ERROR] To see the full stack trace of the errors, re-run Maven with the -e switch.
[ERROR] Re-run Maven using the -X switch to enable full debug logging.
[ERROR] 
[ERROR] For more information about the errors and possible solutions, please read the following
articles:
[ERROR] [Help 1] http://cwiki.apache.org/confluence/display/MAVEN/MojoFailureException
[ERROR] 
[ERROR] After correcting the problems, you can resume the build with the command
[ERROR]   mvn <goals> -rf :httpcore-nio
[JENKINS] Archiving F:\jenkins\jenkins-slave\workspace\httpcomponents-core-4.3.x\httpcore-trunk\httpcore\pom.xml
to org.apache.httpcomponents/httpcore/4.3.2-SNAPSHOT/httpcore-4.3.2-SNAPSHOT.pom
[JENKINS] Archiving F:\jenkins\jenkins-slave\workspace\httpcomponents-core-4.3.x\httpcore-trunk\httpcore\target\httpcore-4.3.2-SNAPSHOT.jar
to org.apache.httpcomponents/httpcore/4.3.2-SNAPSHOT/httpcore-4.3.2-SNAPSHOT.jar
[JENKINS] Archiving F:\jenkins\jenkins-slave\workspace\httpcomponents-core-4.3.x\httpcore-trunk\httpcore\target\httpcore-4.3.2-SNAPSHOT-sources.jar
to org.apache.httpcomponents/httpcore/4.3.2-SNAPSHOT/httpcore-4.3.2-SNAPSHOT-sources.jar
[JENKINS] Archiving F:\jenkins\jenkins-slave\workspace\httpcomponents-core-4.3.x\httpcore-trunk\httpcore\target\httpcore-4.3.2-SNAPSHOT-javadoc.jar
to org.apache.httpcomponents/httpcore/4.3.2-SNAPSHOT/httpcore-4.3.2-SNAPSHOT-javadoc.jar
[JENKINS] Archiving F:\jenkins\jenkins-slave\workspace\httpcomponents-core-4.3.x\httpcore-trunk\httpcore-nio\pom.xml
to org.apache.httpcomponents/httpcore-nio/4.3.2-SNAPSHOT/httpcore-nio-4.3.2-SNAPSHOT.pom
[JENKINS] Archiving F:\jenkins\jenkins-slave\workspace\httpcomponents-core-4.3.x\httpcore-trunk\httpcore-nio\target\httpcore-nio-4.3.2-SNAPSHOT.jar
to org.apache.httpcomponents/httpcore-nio/4.3.2-SNAPSHOT/httpcore-nio-4.3.2-SNAPSHOT.jar
[JENKINS] Archiving F:\jenkins\jenkins-slave\workspace\httpcomponents-core-4.3.x\httpcore-trunk\httpcore-nio\target\httpcore-nio-4.3.2-SNAPSHOT-sources.jar
to org.apache.httpcomponents/httpcore-nio/4.3.2-SNAPSHOT/httpcore-nio-4.3.2-SNAPSHOT-sources.jar
[JENKINS] Archiving F:\jenkins\jenkins-slave\workspace\httpcomponents-core-4.3.x\httpcore-trunk\httpcore-nio\target\httpcore-nio-4.3.2-SNAPSHOT-javadoc.jar
to org.apache.httpcomponents/httpcore-nio/4.3.2-SNAPSHOT/httpcore-nio-4.3.2-SNAPSHOT-javadoc.jar
[JENKINS] Archiving <https://builds.apache.org/job/httpcomponents-core-4.3.x/ws/httpcore-trunk\pom.xml>
to org.apache.httpcomponents/httpcomponents-core/4.3.2-SNAPSHOT/httpcomponents-core-4.3.2-SNAPSHOT.pom
[JENKINS] Archiving F:\jenkins\jenkins-slave\workspace\httpcomponents-core-4.3.x\httpcore-trunk\httpcore-ab\pom.xml
to org.apache.httpcomponents/httpcore-ab/4.3.2-SNAPSHOT/httpcore-ab-4.3.2-SNAPSHOT.pom
[JENKINS] Archiving F:\jenkins\jenkins-slave\workspace\httpcomponents-core-4.3.x\httpcore-trunk\httpcore-osgi\pom.xml
to org.apache.httpcomponents/httpcore-osgi/4.3.2-SNAPSHOT/httpcore-osgi-4.3.2-SNAPSHOT.pom
Sending e-mails to: commits@hc.apache.org
channel stopped

Mime
View raw message