hc-commits mailing list archives

Site index · List index
Message view « Date » · « Thread »
Top « Date » · « Thread »
From Apache Jenkins Server <jenk...@builds.apache.org>
Subject Build failed in Jenkins: httpcomponents-core-4.3.x #554
Date Fri, 10 Jan 2014 00:02:25 GMT
See <https://builds.apache.org/job/httpcomponents-core-4.3.x/554/changes>

Changes:

[sebb] Document tweak

------------------------------------------
[...truncated 219 lines...]
Tests run: 5, Failures: 0, Errors: 0, Skipped: 0, Time elapsed: 0 sec - in org.apache.http.impl.TestDefaultBHttpClientConnection
Running org.apache.http.impl.TestDefaultBHttpServerConnection
Tests run: 6, Failures: 0, Errors: 0, Skipped: 0, Time elapsed: 0 sec - in org.apache.http.impl.TestDefaultBHttpServerConnection
Running org.apache.http.impl.TestDefaultConnectionReuseStrategy
Tests run: 25, Failures: 0, Errors: 0, Skipped: 0, Time elapsed: 0.015 sec - in org.apache.http.impl.TestDefaultConnectionReuseStrategy
Running org.apache.http.impl.TestEnglishReasonPhraseCatalog
Tests run: 3, Failures: 0, Errors: 0, Skipped: 0, Time elapsed: 0 sec - in org.apache.http.impl.TestEnglishReasonPhraseCatalog
Running org.apache.http.impl.TestNoConnectionReuseStrategy
Tests run: 1, Failures: 0, Errors: 0, Skipped: 0, Time elapsed: 0 sec - in org.apache.http.impl.TestNoConnectionReuseStrategy
Running org.apache.http.integration.TestSyncHttp
Tests run: 11, Failures: 0, Errors: 0, Skipped: 0, Time elapsed: 0.969 sec - in org.apache.http.integration.TestSyncHttp
Running org.apache.http.message.TestAbstractMessage
Tests run: 3, Failures: 0, Errors: 0, Skipped: 0, Time elapsed: 0 sec - in org.apache.http.message.TestAbstractMessage
Running org.apache.http.message.TestBasicHeaderElementIterator
Tests run: 3, Failures: 0, Errors: 0, Skipped: 0, Time elapsed: 0 sec - in org.apache.http.message.TestBasicHeaderElementIterator
Running org.apache.http.message.TestBasicHeaderIterator
Tests run: 5, Failures: 0, Errors: 0, Skipped: 0, Time elapsed: 0 sec - in org.apache.http.message.TestBasicHeaderIterator
Running org.apache.http.message.TestBasicHeaderValueFormatter
Tests run: 6, Failures: 0, Errors: 0, Skipped: 0, Time elapsed: 0 sec - in org.apache.http.message.TestBasicHeaderValueFormatter
Running org.apache.http.message.TestBasicHeaderValueParser
Tests run: 10, Failures: 0, Errors: 0, Skipped: 0, Time elapsed: 0 sec - in org.apache.http.message.TestBasicHeaderValueParser
Running org.apache.http.message.TestBasicHttpResponse
Tests run: 3, Failures: 0, Errors: 0, Skipped: 0, Time elapsed: 0 sec - in org.apache.http.message.TestBasicHttpResponse
Running org.apache.http.message.TestBasicLineFormatter
Tests run: 8, Failures: 0, Errors: 0, Skipped: 0, Time elapsed: 0 sec - in org.apache.http.message.TestBasicLineFormatter
Running org.apache.http.message.TestBasicLineParser
Tests run: 7, Failures: 0, Errors: 0, Skipped: 0, Time elapsed: 0 sec - in org.apache.http.message.TestBasicLineParser
Running org.apache.http.message.TestBasicMessages
Tests run: 7, Failures: 0, Errors: 0, Skipped: 0, Time elapsed: 0 sec - in org.apache.http.message.TestBasicMessages
Running org.apache.http.message.TestBasicTokenIterator
Tests run: 9, Failures: 0, Errors: 0, Skipped: 0, Time elapsed: 0 sec - in org.apache.http.message.TestBasicTokenIterator
Running org.apache.http.message.TestBufferedHeader
Tests run: 5, Failures: 0, Errors: 0, Skipped: 0, Time elapsed: 0 sec - in org.apache.http.message.TestBufferedHeader
Running org.apache.http.message.TestHeader
Tests run: 7, Failures: 0, Errors: 0, Skipped: 0, Time elapsed: 0 sec - in org.apache.http.message.TestHeader
Running org.apache.http.message.TestHeaderElement
Tests run: 8, Failures: 0, Errors: 0, Skipped: 0, Time elapsed: 0 sec - in org.apache.http.message.TestHeaderElement
Running org.apache.http.message.TestHeaderGroup
Tests run: 11, Failures: 0, Errors: 0, Skipped: 0, Time elapsed: 0.046 sec - in org.apache.http.message.TestHeaderGroup
Running org.apache.http.message.TestNameValuePair
Tests run: 6, Failures: 0, Errors: 0, Skipped: 0, Time elapsed: 0 sec - in org.apache.http.message.TestNameValuePair
Running org.apache.http.message.TestRequestLine
Tests run: 4, Failures: 0, Errors: 0, Skipped: 0, Time elapsed: 0 sec - in org.apache.http.message.TestRequestLine
Running org.apache.http.message.TestStatusLine
Tests run: 5, Failures: 0, Errors: 0, Skipped: 0, Time elapsed: 0 sec - in org.apache.http.message.TestStatusLine
Running org.apache.http.pool.TestConnPool
Tests run: 18, Failures: 0, Errors: 0, Skipped: 0, Time elapsed: 0.673 sec - in org.apache.http.pool.TestConnPool
Running org.apache.http.pool.TestPoolEntry
Tests run: 5, Failures: 0, Errors: 0, Skipped: 0, Time elapsed: 0.016 sec - in org.apache.http.pool.TestPoolEntry
Running org.apache.http.pool.TestRouteSpecificPool
Tests run: 11, Failures: 0, Errors: 0, Skipped: 0, Time elapsed: 0.031 sec - in org.apache.http.pool.TestRouteSpecificPool
Running org.apache.http.protocol.TestChainBuilder
Tests run: 1, Failures: 0, Errors: 0, Skipped: 0, Time elapsed: 0.016 sec - in org.apache.http.protocol.TestChainBuilder
Running org.apache.http.protocol.TestHttpExecutionContext
Tests run: 3, Failures: 0, Errors: 0, Skipped: 0, Time elapsed: 0 sec - in org.apache.http.protocol.TestHttpExecutionContext
Running org.apache.http.protocol.TestHttpRequestExecutor
Tests run: 12, Failures: 0, Errors: 0, Skipped: 0, Time elapsed: 0.109 sec - in org.apache.http.protocol.TestHttpRequestExecutor
Running org.apache.http.protocol.TestHttpService
Tests run: 12, Failures: 0, Errors: 0, Skipped: 0, Time elapsed: 0.172 sec - in org.apache.http.protocol.TestHttpService
Running org.apache.http.protocol.TestStandardInterceptors
Tests run: 70, Failures: 0, Errors: 0, Skipped: 0, Time elapsed: 0.109 sec - in org.apache.http.protocol.TestStandardInterceptors
Running org.apache.http.protocol.TestUriHttpRequestHandlerMapper
Tests run: 5, Failures: 0, Errors: 0, Skipped: 0, Time elapsed: 0.125 sec - in org.apache.http.protocol.TestUriHttpRequestHandlerMapper
Running org.apache.http.protocol.TestUriPatternMatcher
Tests run: 7, Failures: 0, Errors: 0, Skipped: 0, Time elapsed: 0 sec - in org.apache.http.protocol.TestUriPatternMatcher
Running org.apache.http.TestHttpExceptions
Tests run: 1, Failures: 0, Errors: 0, Skipped: 0, Time elapsed: 0 sec - in org.apache.http.TestHttpExceptions
Running org.apache.http.TestHttpHost
Tests run: 7, Failures: 0, Errors: 0, Skipped: 0, Time elapsed: 0.015 sec - in org.apache.http.TestHttpHost
Running org.apache.http.TestHttpVersion
Tests run: 5, Failures: 0, Errors: 0, Skipped: 0, Time elapsed: 0 sec - in org.apache.http.TestHttpVersion
Running org.apache.http.util.TestArgs
Tests run: 25, Failures: 0, Errors: 0, Skipped: 0, Time elapsed: 0.016 sec - in org.apache.http.util.TestArgs
Running org.apache.http.util.TestAsserts
Tests run: 8, Failures: 0, Errors: 0, Skipped: 0, Time elapsed: 0.015 sec - in org.apache.http.util.TestAsserts
Running org.apache.http.util.TestByteArrayBuffer
Tests run: 15, Failures: 0, Errors: 0, Skipped: 0, Time elapsed: 0.016 sec - in org.apache.http.util.TestByteArrayBuffer
Running org.apache.http.util.TestCharArrayBuffer
Tests run: 21, Failures: 0, Errors: 0, Skipped: 0, Time elapsed: 0.062 sec - in org.apache.http.util.TestCharArrayBuffer
Running org.apache.http.util.TestEncodingUtils
Tests run: 5, Failures: 0, Errors: 0, Skipped: 0, Time elapsed: 0 sec - in org.apache.http.util.TestEncodingUtils
Running org.apache.http.util.TestEntityUtils
Tests run: 13, Failures: 0, Errors: 0, Skipped: 0, Time elapsed: 0.032 sec - in org.apache.http.util.TestEntityUtils
Running org.apache.http.util.TestLangUtils
Tests run: 5, Failures: 0, Errors: 0, Skipped: 0, Time elapsed: 0 sec - in org.apache.http.util.TestLangUtils

Results :

Tests run: 601, Failures: 0, Errors: 0, Skipped: 0

[JENKINS] Recording test results
[INFO] 
[INFO] --- maven-jar-plugin:2.4:jar (default-jar) @ httpcore ---
[INFO] Building jar: F:\jenkins\jenkins-slave\workspace\httpcomponents-core-4.3.x\httpcore-trunk\httpcore\target\httpcore-4.3.2-SNAPSHOT.jar
[INFO] 
[INFO] --- maven-checkstyle-plugin:2.9.1:checkstyle (validate) @ httpcore ---
[INFO] Starting audit...
Audit done.

[INFO] 
[INFO] --- maven-checkstyle-plugin:2.9.1:checkstyle (validate-main) @ httpcore ---
[INFO] Starting audit...
Audit done.

[INFO] 
[INFO] --- maven-checkstyle-plugin:2.9.1:checkstyle (validate-test) @ httpcore ---
[INFO] Starting audit...
Audit done.

[INFO] 
[INFO] --- maven-checkstyle-plugin:2.9.1:checkstyle (validate-examples) @ httpcore ---
[INFO] Starting audit...
Audit done.

[INFO] 
[INFO] --- build-helper-maven-plugin:1.8:add-source (add-source) @ httpcore ---
[INFO] Source directory: F:\jenkins\jenkins-slave\workspace\httpcomponents-core-4.3.x\httpcore-trunk\httpcore\src\main\java-deprecated
added.
[WARNING] Failed to getClass for org.apache.maven.plugin.source.SourceJarMojo
[INFO] 
[INFO] --- maven-source-plugin:2.2.1:jar (attach-sources) @ httpcore ---
[INFO] Building jar: F:\jenkins\jenkins-slave\workspace\httpcomponents-core-4.3.x\httpcore-trunk\httpcore\target\httpcore-4.3.2-SNAPSHOT-sources.jar
[INFO] 
[INFO] --- maven-javadoc-plugin:2.9.1:jar (attach-javadocs) @ httpcore ---
[INFO] Fixed Javadoc frame injection vulnerability (CVE-2013-1571) in 1 files.
[INFO] Building jar: F:\jenkins\jenkins-slave\workspace\httpcomponents-core-4.3.x\httpcore-trunk\httpcore\target\httpcore-4.3.2-SNAPSHOT-javadoc.jar
[INFO] 
[INFO] --- maven-site-plugin:3.3:attach-descriptor (attach-descriptor) @ httpcore ---
[INFO] 
[INFO] --- maven-install-plugin:2.4:install (default-install) @ httpcore ---
[INFO] Installing F:\jenkins\jenkins-slave\workspace\httpcomponents-core-4.3.x\httpcore-trunk\httpcore\target\httpcore-4.3.2-SNAPSHOT.jar
to f:\jenkins\jenkins-slave\maven-repositories\0\org\apache\httpcomponents\httpcore\4.3.2-SNAPSHOT\httpcore-4.3.2-SNAPSHOT.jar
[INFO] Installing F:\jenkins\jenkins-slave\workspace\httpcomponents-core-4.3.x\httpcore-trunk\httpcore\pom.xml
to f:\jenkins\jenkins-slave\maven-repositories\0\org\apache\httpcomponents\httpcore\4.3.2-SNAPSHOT\httpcore-4.3.2-SNAPSHOT.pom
[INFO] Installing F:\jenkins\jenkins-slave\workspace\httpcomponents-core-4.3.x\httpcore-trunk\httpcore\target\httpcore-4.3.2-SNAPSHOT-sources.jar
to f:\jenkins\jenkins-slave\maven-repositories\0\org\apache\httpcomponents\httpcore\4.3.2-SNAPSHOT\httpcore-4.3.2-SNAPSHOT-sources.jar
[INFO] Installing F:\jenkins\jenkins-slave\workspace\httpcomponents-core-4.3.x\httpcore-trunk\httpcore\target\httpcore-4.3.2-SNAPSHOT-javadoc.jar
to f:\jenkins\jenkins-slave\maven-repositories\0\org\apache\httpcomponents\httpcore\4.3.2-SNAPSHOT\httpcore-4.3.2-SNAPSHOT-javadoc.jar
[INFO] 
[INFO] --- maven-checkstyle-plugin:2.9.1:checkstyle (validate) @ httpcore ---
[INFO] Starting audit...
Audit done.

[INFO] 
[INFO] --- maven-checkstyle-plugin:2.9.1:checkstyle (validate-main) @ httpcore ---
[INFO] Starting audit...
Audit done.

[INFO] 
[INFO] --- maven-checkstyle-plugin:2.9.1:checkstyle (validate-test) @ httpcore ---
[INFO] Starting audit...
Audit done.

[INFO] 
[INFO] --- maven-checkstyle-plugin:2.9.1:checkstyle (validate-examples) @ httpcore ---
[INFO] Starting audit...
Audit done.

[INFO] 
[INFO] --- build-helper-maven-plugin:1.8:add-source (add-source) @ httpcore ---
[INFO] Source directory: F:\jenkins\jenkins-slave\workspace\httpcomponents-core-4.3.x\httpcore-trunk\httpcore\src\main\java-deprecated
added.
[INFO] 
[INFO] --- maven-remote-resources-plugin:1.4:process (default) @ httpcore ---
[INFO] 
[INFO] --- buildnumber-maven-plugin:1.2:create (default) @ httpcore ---
[INFO] Checking for local modifications: skipped.
[INFO] Updating project files from SCM: skipped.
[INFO] Executing: cmd.exe /X /C "svn --non-interactive info"
[INFO] Working directory: F:\jenkins\jenkins-slave\workspace\httpcomponents-core-4.3.x\httpcore-trunk\httpcore
[INFO] Storing buildNumber: 1553656 at timestamp: 1389312124900
[INFO] Executing: cmd.exe /X /C "svn --non-interactive info"
[INFO] Working directory: F:\jenkins\jenkins-slave\workspace\httpcomponents-core-4.3.x\httpcore-trunk\httpcore
[INFO] Storing buildScmBranch: trunk
[INFO] 
[INFO] --- maven-resources-plugin:2.6:resources (default-resources) @ httpcore ---
[INFO] Using 'UTF-8' encoding to copy filtered resources.
[INFO] Copying 1 resource
[INFO] Copying 3 resources
[INFO] Copying 3 resources
[INFO] 
[INFO] --- maven-compiler-plugin:3.1:compile (default-compile) @ httpcore ---
[INFO] Changes detected - recompiling the module!
[INFO] Compiling 239 source files to F:\jenkins\jenkins-slave\workspace\httpcomponents-core-4.3.x\httpcore-trunk\httpcore\target\classes
[WARNING] Note: Some input files use or override a deprecated API.
[WARNING] Note: Recompile with -Xlint:deprecation for details.
[WARNING] Failed to getClass for org.codehaus.mojo.clirr.ClirrCheckMojo
[INFO] 
[INFO] --- clirr-maven-plugin:2.5:check (default-cli) @ httpcore ---
[INFO] Comparing to version: 4.3
[INFO] Succeeded with 0 errors; 0 warnings; and 6 other changes.
[INFO]                                                                         
[INFO] ------------------------------------------------------------------------
[INFO] Building Apache HttpCore NIO 4.3.2-SNAPSHOT
[INFO] ------------------------------------------------------------------------
[INFO] 
[INFO] --- maven-clean-plugin:2.5:clean (default-clean) @ httpcore-nio ---
[INFO] Deleting F:\jenkins\jenkins-slave\workspace\httpcomponents-core-4.3.x\httpcore-trunk\httpcore-nio\target
[INFO] 
[INFO] --- maven-checkstyle-plugin:2.9.1:checkstyle (validate) @ httpcore-nio ---
[INFO] Starting audit...
Audit done.

[INFO] 
[INFO] --- maven-checkstyle-plugin:2.9.1:checkstyle (validate-main) @ httpcore-nio ---
[INFO] Starting audit...
Audit done.

[INFO] 
[INFO] --- maven-checkstyle-plugin:2.9.1:checkstyle (validate-test) @ httpcore-nio ---
[INFO] Starting audit...
Audit done.

[INFO] 
[INFO] --- maven-checkstyle-plugin:2.9.1:checkstyle (validate-examples) @ httpcore-nio ---
[INFO] Starting audit...
F:\jenkins\jenkins-slave\workspace\httpcomponents-core-4.3.x\httpcore-trunk\httpcore-nio\src\examples\org\apache\http\examples\nio\NHttpClient.java:63:
Trailing whitespace
Audit done.

[INFO] ------------------------------------------------------------------------
[INFO] Reactor Summary:
[INFO] 
[INFO] Apache HttpComponents Core ........................ SUCCESS [20.625s]
[INFO] Apache HttpCore ................................... SUCCESS [55.470s]
[INFO] Apache HttpCore NIO ............................... FAILURE [5.641s]
[INFO] Apache HttpCore OSGi bundle ....................... SKIPPED
[INFO] Apache HttpCore Benchmarking Tool ................. SKIPPED
[INFO] ------------------------------------------------------------------------
[INFO] BUILD FAILURE
[INFO] ------------------------------------------------------------------------
[INFO] Total time: 1:30.236s
[INFO] Finished at: Thu Jan 09 16:02:17 PST 2014
[INFO] Final Memory: 34M/96M
[INFO] ------------------------------------------------------------------------
Waiting for Jenkins to finish collecting data
[ERROR] Failed to execute goal org.apache.maven.plugins:maven-checkstyle-plugin:2.9.1:checkstyle
(validate-examples) on project httpcore-nio: An error has occurred in Checkstyle report generation.
Failed during checkstyle execution: There are 1 checkstyle errors. -> [Help 1]
[ERROR] 
[ERROR] To see the full stack trace of the errors, re-run Maven with the -e switch.
[ERROR] Re-run Maven using the -X switch to enable full debug logging.
[ERROR] 
[ERROR] For more information about the errors and possible solutions, please read the following
articles:
[ERROR] [Help 1] http://cwiki.apache.org/confluence/display/MAVEN/MojoExecutionException
[ERROR] 
[ERROR] After correcting the problems, you can resume the build with the command
[ERROR]   mvn <goals> -rf :httpcore-nio
[JENKINS] Archiving F:\jenkins\jenkins-slave\workspace\httpcomponents-core-4.3.x\httpcore-trunk\httpcore\pom.xml
to org.apache.httpcomponents/httpcore/4.3.2-SNAPSHOT/httpcore-4.3.2-SNAPSHOT.pom
[JENKINS] Archiving F:\jenkins\jenkins-slave\workspace\httpcomponents-core-4.3.x\httpcore-trunk\httpcore\target\httpcore-4.3.2-SNAPSHOT.jar
to org.apache.httpcomponents/httpcore/4.3.2-SNAPSHOT/httpcore-4.3.2-SNAPSHOT.jar
[JENKINS] Archiving F:\jenkins\jenkins-slave\workspace\httpcomponents-core-4.3.x\httpcore-trunk\httpcore\target\httpcore-4.3.2-SNAPSHOT-sources.jar
to org.apache.httpcomponents/httpcore/4.3.2-SNAPSHOT/httpcore-4.3.2-SNAPSHOT-sources.jar
[JENKINS] Archiving F:\jenkins\jenkins-slave\workspace\httpcomponents-core-4.3.x\httpcore-trunk\httpcore\target\httpcore-4.3.2-SNAPSHOT-javadoc.jar
to org.apache.httpcomponents/httpcore/4.3.2-SNAPSHOT/httpcore-4.3.2-SNAPSHOT-javadoc.jar
[JENKINS] Archiving F:\jenkins\jenkins-slave\workspace\httpcomponents-core-4.3.x\httpcore-trunk\httpcore-nio\pom.xml
to org.apache.httpcomponents/httpcore-nio/4.3.2-SNAPSHOT/httpcore-nio-4.3.2-SNAPSHOT.pom
[JENKINS] Archiving <https://builds.apache.org/job/httpcomponents-core-4.3.x/ws/httpcore-trunk\pom.xml>
to org.apache.httpcomponents/httpcomponents-core/4.3.2-SNAPSHOT/httpcomponents-core-4.3.2-SNAPSHOT.pom
[JENKINS] Archiving F:\jenkins\jenkins-slave\workspace\httpcomponents-core-4.3.x\httpcore-trunk\httpcore-ab\pom.xml
to org.apache.httpcomponents/httpcore-ab/4.3.2-SNAPSHOT/httpcore-ab-4.3.2-SNAPSHOT.pom
[JENKINS] Archiving F:\jenkins\jenkins-slave\workspace\httpcomponents-core-4.3.x\httpcore-trunk\httpcore-osgi\pom.xml
to org.apache.httpcomponents/httpcore-osgi/4.3.2-SNAPSHOT/httpcore-osgi-4.3.2-SNAPSHOT.pom
Sending e-mails to: commits@hc.apache.org
channel stopped

Mime
View raw message