hc-commits mailing list archives

Site index · List index
Message view « Date » · « Thread »
Top « Date » · « Thread »
From Apache Jenkins Server <jenk...@builds.apache.org>
Subject Build failed in Jenkins: httpcomponents-asyncclient-4.0.x #321
Date Thu, 26 Dec 2013 00:16:32 GMT
See <https://builds.apache.org/job/httpcomponents-asyncclient-4.0.x/321/changes>

Changes:

[olegk] HTTPASYNC-62: code improvement
Contributed by Dmitry Potapov <potapov.d at gmail.com>

[olegk] Upgraded HttpCore to version 4.3.1

[olegk] Re-implementation of the HTTPASYNC-40 fix involving an exteremely ugly work-around,
a better solution requires API changes

------------------------------------------
Started by an SCM change
Building remotely on windows2 in workspace <https://builds.apache.org/job/httpcomponents-asyncclient-4.0.x/ws/>
Updating http://svn.apache.org/repos/asf/httpcomponents/httpasyncclient/trunk at revision
'2013-12-25T16:15:00.667 -0800'
U         pom.xml
U         httpasyncclient\src\main\java\org\apache\http\nio\client\methods\AsyncByteConsumer.java
U         httpasyncclient\src\main\java\org\apache\http\nio\client\methods\ZeroCopyConsumer.java
U         httpasyncclient\src\main\java\org\apache\http\nio\client\methods\AsyncCharConsumer.java
At revision 1553430
Parsing POMs
Modules changed, recalculating dependency graph
maven3-agent.jar already up to date
maven3-interceptor.jar already up to date
maven3-interceptor-commons.jar already up to date
[httpasyncclient-trunk] $ f:\jenkins\tools\\java\\latest-1.5-64/bin/java -cp f:\jenkins\jenkins-slave\maven3-agent.jar;f:\jenkins\jenkins-slave\tools\hudson.tasks.Maven_MavenInstallation\Maven_3.0.5\boot\plexus-classworlds-2.4.jar
org.jvnet.hudson.maven3.agent.Maven3Main f:\jenkins\jenkins-slave\tools\hudson.tasks.Maven_MavenInstallation\Maven_3.0.5
F:\jenkins\jenkins-slave\slave.jar f:\jenkins\jenkins-slave\maven3-interceptor.jar f:\jenkins\jenkins-slave\maven3-interceptor-commons.jar
56258
<===[JENKINS REMOTING CAPACITY]===>   channel started
ERROR: [JENKINS-18403] JDK 5 not supported to run Maven; retrying with slave Java and setting
compile/test properties to point to f:\jenkins\tools\\java\\latest-1.5-64
maven3-agent.jar already up to date
maven3-interceptor.jar already up to date
maven3-interceptor-commons.jar already up to date
[httpasyncclient-trunk] $ "C:\Program Files\Java\jre7/bin/java" -cp f:\jenkins\jenkins-slave\maven3-agent.jar;f:\jenkins\jenkins-slave\tools\hudson.tasks.Maven_MavenInstallation\Maven_3.0.5\boot\plexus-classworlds-2.4.jar
org.jvnet.hudson.maven3.agent.Maven3Main f:\jenkins\jenkins-slave\tools\hudson.tasks.Maven_MavenInstallation\Maven_3.0.5
F:\jenkins\jenkins-slave\slave.jar f:\jenkins\jenkins-slave\maven3-interceptor.jar f:\jenkins\jenkins-slave\maven3-interceptor-commons.jar
56260
<===[JENKINS REMOTING CAPACITY]===>   channel started
log4j:WARN No appenders could be found for logger (org.apache.commons.beanutils.converters.BooleanConverter).
log4j:WARN Please initialize the log4j system properly.
Executing Maven:  -B -f <https://builds.apache.org/job/httpcomponents-asyncclient-4.0.x/ws/httpasyncclient-trunk\pom.xml>
-Dmaven.repo.local=f:\jenkins\jenkins-slave\maven-repositories\0 clean install
[INFO] Scanning for projects...
[INFO] ------------------------------------------------------------------------
[INFO] Reactor Build Order:
[INFO] 
[INFO] Apache HttpComponents AsyncClient
[INFO] Apache HttpAsyncClient
[INFO] Apache HttpAsyncClient Cache
[INFO] HttpAsyncClient OSGi bundle
[INFO]                                                                         
[INFO] ------------------------------------------------------------------------
[INFO] Building Apache HttpComponents AsyncClient 4.0.1-SNAPSHOT
[INFO] ------------------------------------------------------------------------
[INFO] 
[INFO] --- maven-clean-plugin:2.5:clean (default-clean) @ httpcomponents-asyncclient ---
[INFO] Deleting <https://builds.apache.org/job/httpcomponents-asyncclient-4.0.x/ws/httpasyncclient-trunk\target>
[INFO] 
[INFO] --- maven-checkstyle-plugin:2.9.1:checkstyle (validate) @ httpcomponents-asyncclient
---
[INFO] 
[INFO] --- maven-checkstyle-plugin:2.9.1:checkstyle (validate-main) @ httpcomponents-asyncclient
---
[INFO] Starting audit...
Audit done.

[INFO] 
[INFO] --- maven-checkstyle-plugin:2.9.1:checkstyle (validate-test) @ httpcomponents-asyncclient
---
[INFO] 
[INFO] --- maven-checkstyle-plugin:2.9.1:checkstyle (validate-examples) @ httpcomponents-asyncclient
---
[INFO] 
[INFO] --- maven-remote-resources-plugin:1.4:process (default) @ httpcomponents-asyncclient
---
[INFO] 
[INFO] --- buildnumber-maven-plugin:1.2:create (default) @ httpcomponents-asyncclient ---
[INFO] Checking for local modifications: skipped.
[INFO] Updating project files from SCM: skipped.
[INFO] Executing: cmd.exe /X /C "svn --non-interactive info"
[INFO] Working directory: <https://builds.apache.org/job/httpcomponents-asyncclient-4.0.x/ws/httpasyncclient-trunk>
[INFO] Storing buildNumber: 1553385 at timestamp: 1388016948608
[INFO] Executing: cmd.exe /X /C "svn --non-interactive info"
[INFO] Working directory: <https://builds.apache.org/job/httpcomponents-asyncclient-4.0.x/ws/httpasyncclient-trunk>
[INFO] Storing buildScmBranch: trunk
[INFO] 
[INFO] --- maven-checkstyle-plugin:2.9.1:checkstyle (validate) @ httpcomponents-asyncclient
---
[INFO] 
[INFO] --- maven-checkstyle-plugin:2.9.1:checkstyle (validate-main) @ httpcomponents-asyncclient
---
[INFO] Starting audit...
Audit done.

[INFO] 
[INFO] --- maven-checkstyle-plugin:2.9.1:checkstyle (validate-test) @ httpcomponents-asyncclient
---
[INFO] 
[INFO] --- maven-checkstyle-plugin:2.9.1:checkstyle (validate-examples) @ httpcomponents-asyncclient
---
[WARNING] Failed to getClass for org.apache.maven.plugin.source.SourceJarMojo
[INFO] 
[INFO] --- maven-source-plugin:2.2.1:jar (attach-sources) @ httpcomponents-asyncclient ---
[INFO] 
[INFO] --- maven-site-plugin:3.3:attach-descriptor (attach-descriptor) @ httpcomponents-asyncclient
---
[INFO] 
[INFO] --- maven-install-plugin:2.4:install (default-install) @ httpcomponents-asyncclient
---
[INFO] Installing <https://builds.apache.org/job/httpcomponents-asyncclient-4.0.x/ws/httpasyncclient-trunk\pom.xml>
to f:\jenkins\jenkins-slave\maven-repositories\0\org\apache\httpcomponents\httpcomponents-asyncclient\4.0.1-SNAPSHOT\httpcomponents-asyncclient-4.0.1-SNAPSHOT.pom
[INFO]                                                                         
[INFO] ------------------------------------------------------------------------
[INFO] Building Apache HttpAsyncClient 4.0.1-SNAPSHOT
[INFO] ------------------------------------------------------------------------
Downloading: http://repo.maven.apache.org/maven2/org/apache/httpcomponents/httpcore/4.3.1/httpcore-4.3.1.pom
Downloaded: http://repo.maven.apache.org/maven2/org/apache/httpcomponents/httpcore/4.3.1/httpcore-4.3.1.pom
(5 KB at 13.0 KB/sec)
Downloading: http://repo.maven.apache.org/maven2/org/apache/httpcomponents/httpcomponents-core/4.3.1/httpcomponents-core-4.3.1.pom
Downloaded: http://repo.maven.apache.org/maven2/org/apache/httpcomponents/httpcomponents-core/4.3.1/httpcomponents-core-4.3.1.pom
(12 KB at 141.3 KB/sec)
Downloading: http://repo.maven.apache.org/maven2/org/apache/httpcomponents/httpcore-nio/4.3.1/httpcore-nio-4.3.1.pom
Downloaded: http://repo.maven.apache.org/maven2/org/apache/httpcomponents/httpcore-nio/4.3.1/httpcore-nio-4.3.1.pom
(5 KB at 23.4 KB/sec)
Downloading: http://repo.maven.apache.org/maven2/org/apache/httpcomponents/httpcore/4.3.1/httpcore-4.3.1.jar
Downloading: http://repo.maven.apache.org/maven2/org/apache/httpcomponents/httpcore-nio/4.3.1/httpcore-nio-4.3.1.jar
Downloaded: http://repo.maven.apache.org/maven2/org/apache/httpcomponents/httpcore/4.3.1/httpcore-4.3.1.jar
(276 KB at 895.0 KB/sec)
Downloaded: http://repo.maven.apache.org/maven2/org/apache/httpcomponents/httpcore-nio/4.3.1/httpcore-nio-4.3.1.jar
(309 KB at 408.0 KB/sec)
[INFO] 
[INFO] --- maven-clean-plugin:2.5:clean (default-clean) @ httpasyncclient ---
[INFO] Deleting F:\jenkins\jenkins-slave\workspace\httpcomponents-asyncclient-4.0.x\httpasyncclient-trunk\httpasyncclient\target
[INFO] 
[INFO] --- maven-checkstyle-plugin:2.9.1:checkstyle (validate) @ httpasyncclient ---
[INFO] Starting audit...
F:\jenkins\jenkins-slave\workspace\httpcomponents-asyncclient-4.0.x\httpasyncclient-trunk\httpasyncclient\src\main\java\org\apache\http\nio\client\methods\ZeroCopyConsumer.java:44:8:
Unused import - org.apache.http.protocol.HTTP.
Audit done.

[INFO] ------------------------------------------------------------------------
[INFO] Reactor Summary:
[INFO] 
[INFO] Apache HttpComponents AsyncClient ................. SUCCESS [24.899s]
[INFO] Apache HttpAsyncClient ............................ FAILURE [10.701s]
[INFO] Apache HttpAsyncClient Cache ...................... SKIPPED
[INFO] HttpAsyncClient OSGi bundle ....................... SKIPPED
[INFO] ------------------------------------------------------------------------
[INFO] BUILD FAILURE
[INFO] ------------------------------------------------------------------------
[INFO] Total time: 39.724s
[INFO] Finished at: Wed Dec 25 16:16:06 PST 2013
[INFO] Final Memory: 25M/61M
[INFO] ------------------------------------------------------------------------
Waiting for Jenkins to finish collecting data
[ERROR] Failed to execute goal org.apache.maven.plugins:maven-checkstyle-plugin:2.9.1:checkstyle
(validate) on project httpasyncclient: An error has occurred in Checkstyle report generation.
Failed during checkstyle execution: There are 1 checkstyle errors. -> [Help 1]
[ERROR] 
[ERROR] To see the full stack trace of the errors, re-run Maven with the -e switch.
[ERROR] Re-run Maven using the -X switch to enable full debug logging.
[JENKINS] Archiving <https://builds.apache.org/job/httpcomponents-asyncclient-4.0.x/ws/httpasyncclient-trunk\pom.xml>
to org.apache.httpcomponents/httpcomponents-asyncclient/4.0.1-SNAPSHOT/httpcomponents-asyncclient-4.0.1-SNAPSHOT.pom
[ERROR] 
[ERROR] For more information about the errors and possible solutions, please read the following
articles:
[ERROR] [Help 1] http://cwiki.apache.org/confluence/display/MAVEN/MojoExecutionException
[ERROR] 
[ERROR] After correcting the problems, you can resume the build with the command
[ERROR]   mvn <goals> -rf :httpasyncclient
[JENKINS] Archiving F:\jenkins\jenkins-slave\workspace\httpcomponents-asyncclient-4.0.x\httpasyncclient-trunk\httpasyncclient-osgi\pom.xml
to org.apache.httpcomponents/httpasyncclient-osgi/4.0.1-SNAPSHOT/httpasyncclient-osgi-4.0.1-SNAPSHOT.pom
[JENKINS] Archiving F:\jenkins\jenkins-slave\workspace\httpcomponents-asyncclient-4.0.x\httpasyncclient-trunk\httpasyncclient-cache\pom.xml
to org.apache.httpcomponents/httpasyncclient-cache/4.0.1-SNAPSHOT/httpasyncclient-cache-4.0.1-SNAPSHOT.pom
[JENKINS] Archiving F:\jenkins\jenkins-slave\workspace\httpcomponents-asyncclient-4.0.x\httpasyncclient-trunk\httpasyncclient\pom.xml
to org.apache.httpcomponents/httpasyncclient/4.0.1-SNAPSHOT/httpasyncclient-4.0.1-SNAPSHOT.pom
Sending e-mails to: commits@hc.apache.org null@apache.org
channel stopped

Mime
View raw message