hc-commits mailing list archives

Site index · List index
Message view « Date » · « Thread »
Top « Date » · « Thread »
From Apache Jenkins Server <jenk...@builds.apache.org>
Subject Build failed in Jenkins: httpcomponents-core-4.3.x #543
Date Tue, 05 Nov 2013 01:20:20 GMT
See <https://builds.apache.org/job/httpcomponents-core-4.3.x/543/changes>

Changes:

[olegk] HTTPCORE-361: Reduced intermediate garbage in HeaderGroup#getFirstHeader()

------------------------------------------
[...truncated 227 lines...]
Running org.apache.http.integration.TestSyncHttp
Tests run: 11, Failures: 0, Errors: 0, Skipped: 0, Time elapsed: 1.28 sec - in org.apache.http.integration.TestSyncHttp
Running org.apache.http.config.TestRegistry
Tests run: 1, Failures: 0, Errors: 0, Skipped: 0, Time elapsed: 0.001 sec - in org.apache.http.config.TestRegistry
Running org.apache.http.TestHttpHost
Tests run: 7, Failures: 0, Errors: 0, Skipped: 0, Time elapsed: 0.002 sec - in org.apache.http.TestHttpHost
Running org.apache.http.TestHttpExceptions
Tests run: 1, Failures: 0, Errors: 0, Skipped: 0, Time elapsed: 0 sec - in org.apache.http.TestHttpExceptions
Running org.apache.http.concurrent.TestBasicFuture
Tests run: 9, Failures: 0, Errors: 0, Skipped: 0, Time elapsed: 0.349 sec - in org.apache.http.concurrent.TestBasicFuture
Running org.apache.http.impl.io.TestContentLengthOutputStream
Tests run: 3, Failures: 0, Errors: 0, Skipped: 0, Time elapsed: 0 sec - in org.apache.http.impl.io.TestContentLengthOutputStream
Running org.apache.http.impl.io.TestContentLengthInputStream
Tests run: 6, Failures: 0, Errors: 0, Skipped: 0, Time elapsed: 0.001 sec - in org.apache.http.impl.io.TestContentLengthInputStream
Running org.apache.http.impl.io.TestIdentityInputStream
Tests run: 4, Failures: 0, Errors: 0, Skipped: 0, Time elapsed: 0.001 sec - in org.apache.http.impl.io.TestIdentityInputStream
Running org.apache.http.impl.io.TestRequestParser
Tests run: 4, Failures: 0, Errors: 0, Skipped: 0, Time elapsed: 0 sec - in org.apache.http.impl.io.TestRequestParser
Running org.apache.http.impl.io.TestResponseParser
Tests run: 4, Failures: 0, Errors: 0, Skipped: 0, Time elapsed: 0.001 sec - in org.apache.http.impl.io.TestResponseParser
Running org.apache.http.impl.io.TestIdentityOutputStream
Tests run: 6, Failures: 0, Errors: 0, Skipped: 0, Time elapsed: 0.001 sec - in org.apache.http.impl.io.TestIdentityOutputStream
Running org.apache.http.impl.io.TestMessageParser
Tests run: 8, Failures: 0, Errors: 0, Skipped: 0, Time elapsed: 0 sec - in org.apache.http.impl.io.TestMessageParser
Running org.apache.http.impl.io.TestChunkCoding
Tests run: 21, Failures: 0, Errors: 0, Skipped: 0, Time elapsed: 0.007 sec - in org.apache.http.impl.io.TestChunkCoding
Running org.apache.http.impl.io.TestSessionInOutBuffers
Tests run: 20, Failures: 0, Errors: 0, Skipped: 0, Time elapsed: 0.069 sec - in org.apache.http.impl.io.TestSessionInOutBuffers
Running org.apache.http.impl.entity.TestLaxContentLengthStrategy
Tests run: 10, Failures: 0, Errors: 0, Skipped: 0, Time elapsed: 0.002 sec - in org.apache.http.impl.entity.TestLaxContentLengthStrategy
Running org.apache.http.impl.entity.TestStrictContentLengthStrategy
Tests run: 8, Failures: 0, Errors: 0, Skipped: 0, Time elapsed: 0.002 sec - in org.apache.http.impl.entity.TestStrictContentLengthStrategy
Running org.apache.http.impl.entity.TestDisallowIdentityContentLengthStrategy
Tests run: 2, Failures: 0, Errors: 0, Skipped: 0, Time elapsed: 0.005 sec - in org.apache.http.impl.entity.TestDisallowIdentityContentLengthStrategy
Running org.apache.http.impl.TestBHttpConnectionBase
Tests run: 22, Failures: 0, Errors: 0, Skipped: 0, Time elapsed: 0.132 sec - in org.apache.http.impl.TestBHttpConnectionBase
Running org.apache.http.impl.pool.TestBasicConnPool
Tests run: 4, Failures: 0, Errors: 0, Skipped: 0, Time elapsed: 3.234 sec - in org.apache.http.impl.pool.TestBasicConnPool
Running org.apache.http.impl.TestNoConnectionReuseStrategy
Tests run: 1, Failures: 0, Errors: 0, Skipped: 0, Time elapsed: 0.012 sec - in org.apache.http.impl.TestNoConnectionReuseStrategy
Running org.apache.http.impl.TestBasicRequest
Tests run: 2, Failures: 0, Errors: 0, Skipped: 0, Time elapsed: 0 sec - in org.apache.http.impl.TestBasicRequest
Running org.apache.http.impl.TestDefaultBHttpClientConnection
Tests run: 5, Failures: 0, Errors: 0, Skipped: 0, Time elapsed: 0.002 sec - in org.apache.http.impl.TestDefaultBHttpClientConnection
Running org.apache.http.impl.TestDefaultBHttpServerConnection
Tests run: 6, Failures: 0, Errors: 0, Skipped: 0, Time elapsed: 0.005 sec - in org.apache.http.impl.TestDefaultBHttpServerConnection
Running org.apache.http.impl.TestEnglishReasonPhraseCatalog
Tests run: 3, Failures: 0, Errors: 0, Skipped: 0, Time elapsed: 0 sec - in org.apache.http.impl.TestEnglishReasonPhraseCatalog
Running org.apache.http.impl.TestDefaultConnectionReuseStrategy
Tests run: 25, Failures: 0, Errors: 0, Skipped: 0, Time elapsed: 0.005 sec - in org.apache.http.impl.TestDefaultConnectionReuseStrategy
Running org.apache.http.protocol.TestHttpExecutionContext
Tests run: 3, Failures: 0, Errors: 0, Skipped: 0, Time elapsed: 0 sec - in org.apache.http.protocol.TestHttpExecutionContext
Running org.apache.http.protocol.TestUriHttpRequestHandlerMapper
Tests run: 5, Failures: 0, Errors: 0, Skipped: 0, Time elapsed: 0.016 sec - in org.apache.http.protocol.TestUriHttpRequestHandlerMapper
Running org.apache.http.protocol.TestChainBuilder
Tests run: 1, Failures: 0, Errors: 0, Skipped: 0, Time elapsed: 0 sec - in org.apache.http.protocol.TestChainBuilder
Running org.apache.http.protocol.TestHttpRequestExecutor
Tests run: 12, Failures: 0, Errors: 0, Skipped: 0, Time elapsed: 0.038 sec - in org.apache.http.protocol.TestHttpRequestExecutor
Running org.apache.http.protocol.TestHttpService
Tests run: 12, Failures: 0, Errors: 0, Skipped: 0, Time elapsed: 0.051 sec - in org.apache.http.protocol.TestHttpService
Running org.apache.http.protocol.TestStandardInterceptors
Tests run: 70, Failures: 0, Errors: 0, Skipped: 0, Time elapsed: 0.027 sec - in org.apache.http.protocol.TestStandardInterceptors
Running org.apache.http.protocol.TestUriPatternMatcher
Tests run: 7, Failures: 0, Errors: 0, Skipped: 0, Time elapsed: 0 sec - in org.apache.http.protocol.TestUriPatternMatcher
Running org.apache.http.TestHttpVersion
Tests run: 5, Failures: 0, Errors: 0, Skipped: 0, Time elapsed: 0.001 sec - in org.apache.http.TestHttpVersion
Running org.apache.http.util.TestByteArrayBuffer
Tests run: 15, Failures: 0, Errors: 0, Skipped: 0, Time elapsed: 0.001 sec - in org.apache.http.util.TestByteArrayBuffer
Running org.apache.http.util.TestEntityUtils
Tests run: 13, Failures: 0, Errors: 0, Skipped: 0, Time elapsed: 0.004 sec - in org.apache.http.util.TestEntityUtils
Running org.apache.http.util.TestCharArrayBuffer
Tests run: 21, Failures: 0, Errors: 0, Skipped: 0, Time elapsed: 0.004 sec - in org.apache.http.util.TestCharArrayBuffer
Running org.apache.http.util.TestLangUtils
Tests run: 5, Failures: 0, Errors: 0, Skipped: 0, Time elapsed: 0 sec - in org.apache.http.util.TestLangUtils
Running org.apache.http.util.TestArgs
Tests run: 25, Failures: 0, Errors: 0, Skipped: 0, Time elapsed: 0.002 sec - in org.apache.http.util.TestArgs
Running org.apache.http.util.TestAsserts
Tests run: 8, Failures: 0, Errors: 0, Skipped: 0, Time elapsed: 0.001 sec - in org.apache.http.util.TestAsserts
Running org.apache.http.util.TestEncodingUtils
Tests run: 5, Failures: 0, Errors: 0, Skipped: 0, Time elapsed: 0.007 sec - in org.apache.http.util.TestEncodingUtils

Results :

Tests run: 601, Failures: 0, Errors: 0, Skipped: 0

[INFO] 
[INFO] --- maven-jar-plugin:2.4:jar (default-jar) @ httpcore ---
[INFO] Building jar: <https://builds.apache.org/job/httpcomponents-core-4.3.x/ws/httpcore-trunk/httpcore/target/httpcore-4.3.1-SNAPSHOT.jar>
[INFO] 
[INFO] --- maven-checkstyle-plugin:2.9.1:checkstyle (validate) @ httpcore ---
[INFO] Starting audit...
Audit done.

[INFO] 
[INFO] --- maven-checkstyle-plugin:2.9.1:checkstyle (validate-main) @ httpcore ---
[INFO] Starting audit...
Audit done.

[INFO] 
[INFO] --- maven-checkstyle-plugin:2.9.1:checkstyle (validate-test) @ httpcore ---
[INFO] Starting audit...
Audit done.

[INFO] 
[INFO] --- maven-checkstyle-plugin:2.9.1:checkstyle (validate-examples) @ httpcore ---
[INFO] Starting audit...
Audit done.

[INFO] 
[INFO] --- build-helper-maven-plugin:1.8:add-source (add-source) @ httpcore ---
[INFO] Source directory: <https://builds.apache.org/job/httpcomponents-core-4.3.x/ws/httpcore-trunk/httpcore/src/main/java-deprecated>
added.
[WARNING] Failed to getClass for org.apache.maven.plugin.source.SourceJarMojo
[INFO] 
[INFO] --- maven-source-plugin:2.2.1:jar (attach-sources) @ httpcore ---
[INFO] Building jar: <https://builds.apache.org/job/httpcomponents-core-4.3.x/ws/httpcore-trunk/httpcore/target/httpcore-4.3.1-SNAPSHOT-sources.jar>
[INFO] 
[INFO] --- maven-javadoc-plugin:2.9.1:jar (attach-javadocs) @ httpcore ---
[INFO] Fixed Javadoc frame injection vulnerability (CVE-2013-1571) in 1 files.
[INFO] Building jar: <https://builds.apache.org/job/httpcomponents-core-4.3.x/ws/httpcore-trunk/httpcore/target/httpcore-4.3.1-SNAPSHOT-javadoc.jar>
[INFO] 
[INFO] --- maven-site-plugin:3.3:attach-descriptor (attach-descriptor) @ httpcore ---
[INFO] 
[INFO] --- maven-install-plugin:2.4:install (default-install) @ httpcore ---
[INFO] Installing <https://builds.apache.org/job/httpcomponents-core-4.3.x/ws/httpcore-trunk/httpcore/target/httpcore-4.3.1-SNAPSHOT.jar>
to /export/home/hudson/hudson-slave/maven-repositories/0/org/apache/httpcomponents/httpcore/4.3.1-SNAPSHOT/httpcore-4.3.1-SNAPSHOT.jar
[INFO] Installing <https://builds.apache.org/job/httpcomponents-core-4.3.x/ws/httpcore-trunk/httpcore/pom.xml>
to /export/home/hudson/hudson-slave/maven-repositories/0/org/apache/httpcomponents/httpcore/4.3.1-SNAPSHOT/httpcore-4.3.1-SNAPSHOT.pom
[INFO] Installing <https://builds.apache.org/job/httpcomponents-core-4.3.x/ws/httpcore-trunk/httpcore/target/httpcore-4.3.1-SNAPSHOT-sources.jar>
to /export/home/hudson/hudson-slave/maven-repositories/0/org/apache/httpcomponents/httpcore/4.3.1-SNAPSHOT/httpcore-4.3.1-SNAPSHOT-sources.jar
[INFO] Installing <https://builds.apache.org/job/httpcomponents-core-4.3.x/ws/httpcore-trunk/httpcore/target/httpcore-4.3.1-SNAPSHOT-javadoc.jar>
to /export/home/hudson/hudson-slave/maven-repositories/0/org/apache/httpcomponents/httpcore/4.3.1-SNAPSHOT/httpcore-4.3.1-SNAPSHOT-javadoc.jar
[INFO] 
[INFO] --- maven-checkstyle-plugin:2.9.1:checkstyle (validate) @ httpcore ---
[INFO] Starting audit...
Audit done.

[INFO] 
[INFO] --- maven-checkstyle-plugin:2.9.1:checkstyle (validate-main) @ httpcore ---
[INFO] Starting audit...
Audit done.

[INFO] 
[INFO] --- maven-checkstyle-plugin:2.9.1:checkstyle (validate-test) @ httpcore ---
[INFO] Starting audit...
Audit done.

[INFO] 
[INFO] --- maven-checkstyle-plugin:2.9.1:checkstyle (validate-examples) @ httpcore ---
[INFO] Starting audit...
Audit done.

[INFO] 
[INFO] --- build-helper-maven-plugin:1.8:add-source (add-source) @ httpcore ---
[INFO] Source directory: <https://builds.apache.org/job/httpcomponents-core-4.3.x/ws/httpcore-trunk/httpcore/src/main/java-deprecated>
added.
[INFO] 
[INFO] --- maven-remote-resources-plugin:1.4:process (default) @ httpcore ---
[INFO] 
[INFO] --- buildnumber-maven-plugin:1.2:create (default) @ httpcore ---
[INFO] Checking for local modifications: skipped.
[INFO] Updating project files from SCM: skipped.
[INFO] Executing: /bin/sh -c cd <https://builds.apache.org/job/httpcomponents-core-4.3.x/ws/httpcore-trunk/httpcore>
&& svn --non-interactive info
[INFO] Working directory: <https://builds.apache.org/job/httpcomponents-core-4.3.x/ws/httpcore-trunk/httpcore>
[INFO] Storing buildNumber: 1538607 at timestamp: 1383613155813
[INFO] Executing: /bin/sh -c cd <https://builds.apache.org/job/httpcomponents-core-4.3.x/ws/httpcore-trunk/httpcore>
&& svn --non-interactive info
[INFO] Working directory: <https://builds.apache.org/job/httpcomponents-core-4.3.x/ws/httpcore-trunk/httpcore>
[INFO] Storing buildScmBranch: trunk
[INFO] 
[INFO] --- maven-resources-plugin:2.6:resources (default-resources) @ httpcore ---
[INFO] Using 'UTF-8' encoding to copy filtered resources.
[INFO] Copying 1 resource
[INFO] Copying 3 resources
[INFO] Copying 3 resources
[INFO] 
[INFO] --- maven-compiler-plugin:3.1:compile (default-compile) @ httpcore ---
[INFO] Changes detected - recompiling the module!
[INFO] Compiling 239 source files to <https://builds.apache.org/job/httpcomponents-core-4.3.x/ws/httpcore-trunk/httpcore/target/classes>
[WARNING] Note: Some input files use or override a deprecated API.
[WARNING] Note: Recompile with -Xlint:deprecation for details.
[WARNING] Failed to getClass for org.codehaus.mojo.clirr.ClirrCheckMojo
[INFO] 
[INFO] --- clirr-maven-plugin:2.5:check (default-cli) @ httpcore ---
[INFO] Comparing to version: 4.3
[INFO] Succeeded with 0 errors; 0 warnings; and 6 other changes.
Build timed out (after 30 minutes). Marking the build as failed.
[INFO]                                                                         
[INFO] ------------------------------------------------------------------------
[INFO] Building Apache HttpCore NIO 4.3.1-SNAPSHOT
[INFO] ------------------------------------------------------------------------
[WARNING] The POM for org.apache.httpcomponents:httpcore:jar:4.3.1-SNAPSHOT is invalid, transitive
dependencies (if any) will not be available, enable debug logging for more details
[INFO] 
[INFO] --- maven-clean-plugin:2.5:clean (default-clean) @ httpcore-nio ---
[INFO] Deleting <https://builds.apache.org/job/httpcomponents-core-4.3.x/ws/httpcore-trunk/httpcore-nio/target>
[INFO] ------------------------------------------------------------------------
[INFO] Reactor Summary:
[INFO] 
[INFO] Apache HttpComponents Core ........................ SUCCESS [3:45.778s]
[INFO] Apache HttpCore ................................... SUCCESS [4:22.859s]
[INFO] Apache HttpCore NIO ............................... FAILURE [1:10.629s]
[INFO] Apache HttpCore OSGi bundle ....................... SKIPPED
[INFO] Apache HttpCore Benchmarking Tool ................. SKIPPED
[INFO] ------------------------------------------------------------------------
[INFO] BUILD FAILURE
[INFO] ------------------------------------------------------------------------
[INFO] Total time: 20:53.275s
[INFO] Finished at: Tue Nov 05 01:06:24 GMT+00:00 2013
[INFO] Final Memory: 34M/315M
[INFO] ------------------------------------------------------------------------
[ERROR] Internal error: java.lang.IllegalStateException: Unable to call isArchivingDisabled.
Invalid object ID 7 -> [Help 1]
org.apache.maven.InternalErrorException: Internal error: java.lang.IllegalStateException:
Unable to call isArchivingDisabled. Invalid object ID 7
	at org.apache.maven.DefaultMaven.execute(DefaultMaven.java:168)
	at org.jvnet.hudson.maven3.launcher.Maven3Launcher.main(Maven3Launcher.java:117)
	at sun.reflect.NativeMethodAccessorImpl.invoke0(Native Method)
	at sun.reflect.NativeMethodAccessorImpl.invoke(NativeMethodAccessorImpl.java:39)
	at sun.reflect.DelegatingMethodAccessorImpl.invoke(DelegatingMethodAccessorImpl.java:25)
	at java.lang.reflect.Method.invoke(Method.java:597)
	at org.codehaus.plexus.classworlds.launcher.Launcher.launchStandard(Launcher.java:329)
	at org.codehaus.plexus.classworlds.launcher.Launcher.launch(Launcher.java:239)
	at org.jvnet.hudson.maven3.agent.Maven3Main.launch(Maven3Main.java:178)
	at sun.reflect.NativeMethodAccessorImpl.invoke0(Native Method)
	at sun.reflect.NativeMethodAccessorImpl.invoke(NativeMethodAccessorImpl.java:39)
	at sun.reflect.DelegatingMethodAccessorImpl.invoke(DelegatingMethodAccessorImpl.java:25)
	at java.lang.reflect.Method.invoke(Method.java:597)
	at hudson.maven.Maven3Builder.call(Maven3Builder.java:134)
	at hudson.maven.Maven3Builder.call(Maven3Builder.java:69)
	at hudson.remoting.UserRequest.perform(UserRequest.java:118)
	at hudson.remoting.UserRequest.perform(UserRequest.java:48)
	at hudson.remoting.Request$2.run(Request.java:326)
	at hudson.remoting.InterceptingExecutorService$1.call(InterceptingExecutorService.java:72)
	at java.util.concurrent.FutureTask$Sync.innerRun(FutureTask.java:303)
	at java.util.concurrent.FutureTask.run(FutureTask.java:138)
	at java.util.concurrent.ThreadPoolExecutor$Worker.runTask(ThreadPoolExecutor.java:886)
	at java.util.concurrent.ThreadPoolExecutor$Worker.run(ThreadPoolExecutor.java:908)
	at java.lang.Thread.run(Thread.java:662)
Caused by: java.lang.IllegalStateException: Unable to call isArchivingDisabled. Invalid object
ID 7
	at hudson.remoting.RemoteInvocationHandler$RPCRequest.perform(RemoteInvocationHandler.java:293)
	at hudson.remoting.RemoteInvocationHandler$RPCRequest.call(RemoteInvocationHandler.java:280)
	at hudson.remoting.RemoteInvocationHandler$RPCRequest.call(RemoteInvocationHandler.java:239)
	at hudson.remoting.UserRequest.perform(UserRequest.java:118)
	at hudson.remoting.UserRequest.perform(UserRequest.java:48)
	at hudson.remoting.Request$2.run(Request.java:326)
	at hudson.remoting.InterceptingExecutorService$1.call(InterceptingExecutorService.java:72)
	at java.util.concurrent.FutureTask$Sync.innerRun(FutureTask.java:334)
	at java.util.concurrent.FutureTask.run(FutureTask.java:166)
	at java.util.concurrent.ThreadPoolExecutor.runWorker(ThreadPoolExecutor.java:1145)
	at java.util.concurrent.ThreadPoolExecutor$Worker.run(ThreadPoolExecutor.java:615)
	at java.lang.Thread.run(Thread.java:724)
[ERROR] 
[ERROR] To see the full stack trace of the errors, re-run Maven with the -e switch.
[ERROR] Re-run Maven using the -X switch to enable full debug logging.
[ERROR] 
[ERROR] For more information about the errors and possible solutions, please read the following
articles:
[ERROR] [Help 1] http://cwiki.apache.org/confluence/display/MAVEN/InternalErrorException
channel stopped

Mime
View raw message