hc-commits mailing list archives

Site index · List index
Message view « Date » · « Thread »
Top « Date » · « Thread »
From Apache Jenkins Server <jenk...@builds.apache.org>
Subject Build failed in Jenkins: HttpComponents Core #519
Date Fri, 02 Aug 2013 15:45:01 GMT
See <https://builds.apache.org/job/HttpComponents%20Core/519/>

------------------------------------------
[...truncated 227 lines...]
Running org.apache.http.TestHttpExceptions
Tests run: 1, Failures: 0, Errors: 0, Skipped: 0, Time elapsed: 0 sec - in org.apache.http.TestHttpExceptions
Running org.apache.http.util.TestAsserts
Tests run: 8, Failures: 0, Errors: 0, Skipped: 0, Time elapsed: 0.001 sec - in org.apache.http.util.TestAsserts
Running org.apache.http.util.TestArgs
Tests run: 25, Failures: 0, Errors: 0, Skipped: 0, Time elapsed: 0.007 sec - in org.apache.http.util.TestArgs
Running org.apache.http.util.TestLangUtils
Tests run: 5, Failures: 0, Errors: 0, Skipped: 0, Time elapsed: 0 sec - in org.apache.http.util.TestLangUtils
Running org.apache.http.util.TestByteArrayBuffer
Tests run: 15, Failures: 0, Errors: 0, Skipped: 0, Time elapsed: 0.018 sec - in org.apache.http.util.TestByteArrayBuffer
Running org.apache.http.util.TestEncodingUtils
Tests run: 5, Failures: 0, Errors: 0, Skipped: 0, Time elapsed: 0.023 sec - in org.apache.http.util.TestEncodingUtils
Running org.apache.http.util.TestEntityUtils
Tests run: 13, Failures: 0, Errors: 0, Skipped: 0, Time elapsed: 0.013 sec - in org.apache.http.util.TestEntityUtils
Running org.apache.http.util.TestCharArrayBuffer
Tests run: 21, Failures: 0, Errors: 0, Skipped: 0, Time elapsed: 0.006 sec - in org.apache.http.util.TestCharArrayBuffer
Running org.apache.http.impl.io.TestChunkCoding
Tests run: 21, Failures: 0, Errors: 0, Skipped: 0, Time elapsed: 0.015 sec - in org.apache.http.impl.io.TestChunkCoding
Running org.apache.http.impl.io.TestSessionInOutBuffers
Tests run: 20, Failures: 0, Errors: 0, Skipped: 0, Time elapsed: 0.063 sec - in org.apache.http.impl.io.TestSessionInOutBuffers
Running org.apache.http.impl.io.TestMessageParser
Tests run: 8, Failures: 0, Errors: 0, Skipped: 0, Time elapsed: 0.002 sec - in org.apache.http.impl.io.TestMessageParser
Running org.apache.http.impl.io.TestResponseParser
Tests run: 4, Failures: 0, Errors: 0, Skipped: 0, Time elapsed: 0.003 sec - in org.apache.http.impl.io.TestResponseParser
Running org.apache.http.impl.io.TestContentLengthInputStream
Tests run: 6, Failures: 0, Errors: 0, Skipped: 0, Time elapsed: 0.002 sec - in org.apache.http.impl.io.TestContentLengthInputStream
Running org.apache.http.impl.io.TestContentLengthOutputStream
Tests run: 3, Failures: 0, Errors: 0, Skipped: 0, Time elapsed: 0 sec - in org.apache.http.impl.io.TestContentLengthOutputStream
Running org.apache.http.impl.io.TestRequestParser
Tests run: 4, Failures: 0, Errors: 0, Skipped: 0, Time elapsed: 0.002 sec - in org.apache.http.impl.io.TestRequestParser
Running org.apache.http.impl.io.TestIdentityOutputStream
Tests run: 6, Failures: 0, Errors: 0, Skipped: 0, Time elapsed: 0.002 sec - in org.apache.http.impl.io.TestIdentityOutputStream
Running org.apache.http.impl.io.TestIdentityInputStream
Tests run: 4, Failures: 0, Errors: 0, Skipped: 0, Time elapsed: 0.001 sec - in org.apache.http.impl.io.TestIdentityInputStream
Running org.apache.http.impl.TestDefaultBHttpClientConnection
Tests run: 5, Failures: 0, Errors: 0, Skipped: 0, Time elapsed: 0.035 sec - in org.apache.http.impl.TestDefaultBHttpClientConnection
Running org.apache.http.impl.TestEnglishReasonPhraseCatalog
Tests run: 3, Failures: 0, Errors: 0, Skipped: 0, Time elapsed: 0.001 sec - in org.apache.http.impl.TestEnglishReasonPhraseCatalog
Running org.apache.http.impl.TestBasicRequest
Tests run: 2, Failures: 0, Errors: 0, Skipped: 0, Time elapsed: 0 sec - in org.apache.http.impl.TestBasicRequest
Running org.apache.http.impl.TestBHttpConnectionBase
Tests run: 22, Failures: 0, Errors: 0, Skipped: 0, Time elapsed: 0.054 sec - in org.apache.http.impl.TestBHttpConnectionBase
Running org.apache.http.impl.TestNoConnectionReuseStrategy
Tests run: 1, Failures: 0, Errors: 0, Skipped: 0, Time elapsed: 0.013 sec - in org.apache.http.impl.TestNoConnectionReuseStrategy
Running org.apache.http.impl.TestDefaultBHttpServerConnection
Tests run: 6, Failures: 0, Errors: 0, Skipped: 0, Time elapsed: 0.007 sec - in org.apache.http.impl.TestDefaultBHttpServerConnection
Running org.apache.http.impl.TestDefaultConnectionReuseStrategy
Tests run: 25, Failures: 0, Errors: 0, Skipped: 0, Time elapsed: 0.011 sec - in org.apache.http.impl.TestDefaultConnectionReuseStrategy
Running org.apache.http.impl.pool.TestBasicConnPool
Tests run: 4, Failures: 0, Errors: 0, Skipped: 0, Time elapsed: 0.419 sec - in org.apache.http.impl.pool.TestBasicConnPool
Running org.apache.http.impl.entity.TestLaxContentLengthStrategy
Tests run: 10, Failures: 0, Errors: 0, Skipped: 0, Time elapsed: 0.002 sec - in org.apache.http.impl.entity.TestLaxContentLengthStrategy
Running org.apache.http.impl.entity.TestStrictContentLengthStrategy
Tests run: 8, Failures: 0, Errors: 0, Skipped: 0, Time elapsed: 0.001 sec - in org.apache.http.impl.entity.TestStrictContentLengthStrategy
Running org.apache.http.impl.entity.TestDisallowIdentityContentLengthStrategy
Tests run: 2, Failures: 0, Errors: 0, Skipped: 0, Time elapsed: 0.004 sec - in org.apache.http.impl.entity.TestDisallowIdentityContentLengthStrategy
Running org.apache.http.TestHttpHost
Tests run: 7, Failures: 0, Errors: 0, Skipped: 0, Time elapsed: 0.003 sec - in org.apache.http.TestHttpHost
Running org.apache.http.concurrent.TestBasicFuture
Tests run: 9, Failures: 0, Errors: 0, Skipped: 0, Time elapsed: 0.305 sec - in org.apache.http.concurrent.TestBasicFuture
Running org.apache.http.message.TestBasicHeaderElementIterator
Tests run: 3, Failures: 0, Errors: 0, Skipped: 0, Time elapsed: 0.001 sec - in org.apache.http.message.TestBasicHeaderElementIterator
Running org.apache.http.message.TestBufferedHeader
Tests run: 5, Failures: 0, Errors: 0, Skipped: 0, Time elapsed: 0.002 sec - in org.apache.http.message.TestBufferedHeader
Running org.apache.http.message.TestBasicMessages
Tests run: 7, Failures: 0, Errors: 0, Skipped: 0, Time elapsed: 0.001 sec - in org.apache.http.message.TestBasicMessages
Running org.apache.http.message.TestAbstractMessage
Tests run: 3, Failures: 0, Errors: 0, Skipped: 0, Time elapsed: 0.001 sec - in org.apache.http.message.TestAbstractMessage
Running org.apache.http.message.TestBasicLineParser
Tests run: 7, Failures: 0, Errors: 0, Skipped: 0, Time elapsed: 0.001 sec - in org.apache.http.message.TestBasicLineParser
Running org.apache.http.message.TestBasicLineFormatter
Tests run: 8, Failures: 0, Errors: 0, Skipped: 0, Time elapsed: 0 sec - in org.apache.http.message.TestBasicLineFormatter
Running org.apache.http.message.TestHeader
Tests run: 7, Failures: 0, Errors: 0, Skipped: 0, Time elapsed: 0.001 sec - in org.apache.http.message.TestHeader
Running org.apache.http.message.TestBasicTokenIterator
Tests run: 9, Failures: 0, Errors: 0, Skipped: 0, Time elapsed: 0.002 sec - in org.apache.http.message.TestBasicTokenIterator
Running org.apache.http.message.TestBasicHttpResponse
Tests run: 3, Failures: 0, Errors: 0, Skipped: 0, Time elapsed: 0.001 sec - in org.apache.http.message.TestBasicHttpResponse
Running org.apache.http.message.TestBasicHeaderValueFormatter
Tests run: 6, Failures: 0, Errors: 0, Skipped: 0, Time elapsed: 0.001 sec - in org.apache.http.message.TestBasicHeaderValueFormatter
Running org.apache.http.message.TestStatusLine
Tests run: 5, Failures: 0, Errors: 0, Skipped: 0, Time elapsed: 0.002 sec - in org.apache.http.message.TestStatusLine
Running org.apache.http.message.TestBasicHeaderValueParser
Tests run: 10, Failures: 0, Errors: 0, Skipped: 0, Time elapsed: 0.001 sec - in org.apache.http.message.TestBasicHeaderValueParser
Running org.apache.http.message.TestRequestLine
Tests run: 4, Failures: 0, Errors: 0, Skipped: 0, Time elapsed: 0 sec - in org.apache.http.message.TestRequestLine
Running org.apache.http.message.TestNameValuePair
Tests run: 6, Failures: 0, Errors: 0, Skipped: 0, Time elapsed: 0.001 sec - in org.apache.http.message.TestNameValuePair
Running org.apache.http.message.TestHeaderGroup
Tests run: 11, Failures: 0, Errors: 0, Skipped: 0, Time elapsed: 0.004 sec - in org.apache.http.message.TestHeaderGroup
Running org.apache.http.message.TestBasicHeaderIterator
Tests run: 5, Failures: 0, Errors: 0, Skipped: 0, Time elapsed: 0 sec - in org.apache.http.message.TestBasicHeaderIterator
Running org.apache.http.message.TestHeaderElement
Tests run: 8, Failures: 0, Errors: 0, Skipped: 0, Time elapsed: 0.001 sec - in org.apache.http.message.TestHeaderElement
Running org.apache.http.pool.TestRouteSpecificPool
Tests run: 11, Failures: 0, Errors: 0, Skipped: 0, Time elapsed: 0.016 sec - in org.apache.http.pool.TestRouteSpecificPool
Running org.apache.http.pool.TestPoolEntry
Tests run: 5, Failures: 0, Errors: 0, Skipped: 0, Time elapsed: 0.001 sec - in org.apache.http.pool.TestPoolEntry
Running org.apache.http.pool.TestConnPool
Tests run: 18, Failures: 0, Errors: 0, Skipped: 0, Time elapsed: 0.659 sec - in org.apache.http.pool.TestConnPool
Running org.apache.http.TestHttpVersion
Tests run: 5, Failures: 0, Errors: 0, Skipped: 0, Time elapsed: 0.001 sec - in org.apache.http.TestHttpVersion
Running org.apache.http.integration.TestSyncHttp
Tests run: 11, Failures: 0, Errors: 0, Skipped: 0, Time elapsed: 5.207 sec - in org.apache.http.integration.TestSyncHttp
Running org.apache.http.entity.TestBufferedHttpEntity
Tests run: 5, Failures: 0, Errors: 0, Skipped: 0, Time elapsed: 0.02 sec - in org.apache.http.entity.TestBufferedHttpEntity
Running org.apache.http.entity.TestHttpEntityWrapper
Tests run: 4, Failures: 0, Errors: 0, Skipped: 0, Time elapsed: 0 sec - in org.apache.http.entity.TestHttpEntityWrapper
Running org.apache.http.entity.TestSerializableEntity
Tests run: 5, Failures: 0, Errors: 0, Skipped: 0, Time elapsed: 0.001 sec - in org.apache.http.entity.TestSerializableEntity
Running org.apache.http.entity.TestAbstractHttpEntity
Tests run: 3, Failures: 0, Errors: 0, Skipped: 0, Time elapsed: 0 sec - in org.apache.http.entity.TestAbstractHttpEntity
Running org.apache.http.entity.TestInputStreamEntity
Tests run: 7, Failures: 0, Errors: 0, Skipped: 0, Time elapsed: 0 sec - in org.apache.http.entity.TestInputStreamEntity
Running org.apache.http.entity.TestEntityTemplate
Tests run: 4, Failures: 0, Errors: 0, Skipped: 0, Time elapsed: 0.001 sec - in org.apache.http.entity.TestEntityTemplate
Running org.apache.http.entity.TestContentType
Tests run: 13, Failures: 0, Errors: 0, Skipped: 0, Time elapsed: 0 sec - in org.apache.http.entity.TestContentType
Running org.apache.http.entity.TestBasicHttpEntity
Tests run: 3, Failures: 0, Errors: 0, Skipped: 0, Time elapsed: 0 sec - in org.apache.http.entity.TestBasicHttpEntity
Running org.apache.http.entity.TestFileEntity
Tests run: 3, Failures: 0, Errors: 0, Skipped: 0, Time elapsed: 0.001 sec - in org.apache.http.entity.TestFileEntity
Running org.apache.http.entity.TestStringEntity
Tests run: 5, Failures: 0, Errors: 0, Skipped: 0, Time elapsed: 0.001 sec - in org.apache.http.entity.TestStringEntity
Running org.apache.http.entity.TestByteArrayEntity
Tests run: 8, Failures: 0, Errors: 0, Skipped: 0, Time elapsed: 0 sec - in org.apache.http.entity.TestByteArrayEntity

Results :

Tests run: 601, Failures: 0, Errors: 0, Skipped: 0

Aug 2, 2013 3:44:48 PM org.apache.maven.cli.event.ExecutionEventLogger logReactorSummary
INFO: ------------------------------------------------------------------------
Aug 2, 2013 3:44:48 PM org.apache.maven.cli.event.ExecutionEventLogger logReactorSummary
INFO: Reactor Summary:
Aug 2, 2013 3:44:48 PM org.apache.maven.cli.event.ExecutionEventLogger logReactorSummary
INFO: 
Aug 2, 2013 3:44:48 PM org.apache.maven.cli.event.ExecutionEventLogger logReactorSummary
INFO: Apache HttpComponents Core ........................ SUCCESS [28.573s]
Aug 2, 2013 3:44:48 PM org.apache.maven.cli.event.ExecutionEventLogger logReactorSummary
INFO: Apache HttpCore ................................... FAILURE [20.495s]
Aug 2, 2013 3:44:48 PM org.apache.maven.cli.event.ExecutionEventLogger logReactorSummary
INFO: Apache HttpCore NIO ............................... SKIPPED
Aug 2, 2013 3:44:48 PM org.apache.maven.cli.event.ExecutionEventLogger logReactorSummary
INFO: Apache HttpCore OSGi bundle ....................... SKIPPED
Aug 2, 2013 3:44:48 PM org.apache.maven.cli.event.ExecutionEventLogger logReactorSummary
INFO: Apache HttpCore Benchmarking Tool ................. SKIPPED
Aug 2, 2013 3:44:48 PM org.apache.maven.cli.event.ExecutionEventLogger logResult
INFO: ------------------------------------------------------------------------
Aug 2, 2013 3:44:48 PM org.apache.maven.cli.event.ExecutionEventLogger logResult
INFO: BUILD FAILURE
Aug 2, 2013 3:44:48 PM org.apache.maven.cli.event.ExecutionEventLogger logStats
INFO: ------------------------------------------------------------------------
Aug 2, 2013 3:44:48 PM org.apache.maven.cli.event.ExecutionEventLogger logStats
INFO: Total time: 53.358s
Aug 2, 2013 3:44:48 PM org.apache.maven.cli.event.ExecutionEventLogger logStats
INFO: Finished at: Fri Aug 02 15:44:48 UTC 2013
Aug 2, 2013 3:44:48 PM org.apache.maven.cli.event.ExecutionEventLogger logStats
INFO: Final Memory: 28M/94M
Aug 2, 2013 3:44:48 PM org.apache.maven.cli.event.ExecutionEventLogger sessionEnded
INFO: ------------------------------------------------------------------------
[JENKINS] Archiving <https://builds.apache.org/job/HttpComponents%20Core/ws/httpcore-trunk/httpcore-nio/pom.xml>
to /home/hudson/hudson/jobs/HttpComponents Core/modules/org.apache.httpcomponents$httpcore-nio/builds/2013-08-02_15-43-44/archive/org.apache.httpcomponents/httpcore-nio/4.3.1-SNAPSHOT/httpcore-nio-4.3.1-SNAPSHOT.pom
[JENKINS] Archiving <https://builds.apache.org/job/HttpComponents%20Core/ws/httpcore-trunk/httpcore/pom.xml>
to /home/hudson/hudson/jobs/HttpComponents Core/modules/org.apache.httpcomponents$httpcore/builds/2013-08-02_15-43-44/archive/org.apache.httpcomponents/httpcore/4.3.1-SNAPSHOT/httpcore-4.3.1-SNAPSHOT.pom
[JENKINS] Archiving <https://builds.apache.org/job/HttpComponents%20Core/ws/httpcore-trunk/httpcore-osgi/pom.xml>
to /home/hudson/hudson/jobs/HttpComponents Core/modules/org.apache.httpcomponents$httpcore-osgi/builds/2013-08-02_15-43-44/archive/org.apache.httpcomponents/httpcore-osgi/4.3.1-SNAPSHOT/httpcore-osgi-4.3.1-SNAPSHOT.pom
[JENKINS] Archiving <https://builds.apache.org/job/HttpComponents%20Core/ws/httpcore-trunk/pom.xml>
to /home/hudson/hudson/jobs/HttpComponents Core/modules/org.apache.httpcomponents$httpcomponents-core/builds/2013-08-02_15-43-43/archive/org.apache.httpcomponents/httpcomponents-core/4.3.1-SNAPSHOT/httpcomponents-core-4.3.1-SNAPSHOT.pom
[JENKINS] Archiving <https://builds.apache.org/job/HttpComponents%20Core/ws/httpcore-trunk/httpcore-ab/pom.xml>
to /home/hudson/hudson/jobs/HttpComponents Core/modules/org.apache.httpcomponents$httpcore-ab/builds/2013-08-02_15-43-44/archive/org.apache.httpcomponents/httpcore-ab/4.3.1-SNAPSHOT/httpcore-ab-4.3.1-SNAPSHOT.pom
Waiting for Jenkins to finish collecting data
mavenExecutionResult exceptions not empty
message : Internal error: hudson.remoting.RemotingSystemException: java.io.StreamCorruptedException:
invalid handle value: 007E6010
cause : java.io.StreamCorruptedException: invalid handle value: 007E6010
Stack trace : 
org.apache.maven.InternalErrorException: Internal error: hudson.remoting.RemotingSystemException:
java.io.StreamCorruptedException: invalid handle value: 007E6010
	at org.apache.maven.lifecycle.internal.BuilderCommon.handleBuildError(BuilderCommon.java:128)
	at org.apache.maven.lifecycle.internal.LifecycleModuleBuilder.buildProject(LifecycleModuleBuilder.java:95)
	at org.apache.maven.lifecycle.internal.LifecycleModuleBuilder.buildProject(LifecycleModuleBuilder.java:59)
	at org.apache.maven.lifecycle.internal.LifecycleStarter.singleThreadedBuild(LifecycleStarter.java:183)
	at org.apache.maven.lifecycle.internal.LifecycleStarter.execute(LifecycleStarter.java:161)
	at org.apache.maven.DefaultMaven.doExecute(DefaultMaven.java:319)
	at org.apache.maven.DefaultMaven.execute(DefaultMaven.java:156)
	at org.jvnet.hudson.maven3.launcher.Maven3Launcher.main(Maven3Launcher.java:117)
	at sun.reflect.NativeMethodAccessorImpl.invoke0(Native Method)
	at sun.reflect.NativeMethodAccessorImpl.invoke(NativeMethodAccessorImpl.java:39)
	at sun.reflect.DelegatingMethodAccessorImpl.invoke(DelegatingMethodAccessorImpl.java:25)
	at java.lang.reflect.Method.invoke(Method.java:597)
	at org.codehaus.plexus.classworlds.launcher.Launcher.launchStandard(Launcher.java:329)
	at org.codehaus.plexus.classworlds.launcher.Launcher.launch(Launcher.java:239)
	at org.jvnet.hudson.maven3.agent.Maven3Main.launch(Maven3Main.java:178)
	at sun.reflect.NativeMethodAccessorImpl.invoke0(Native Method)
	at sun.reflect.NativeMethodAccessorImpl.invoke(NativeMethodAccessorImpl.java:39)
	at sun.reflect.DelegatingMethodAccessorImpl.invoke(DelegatingMethodAccessorImpl.java:25)
	at java.lang.reflect.Method.invoke(Method.java:597)
	at hudson.maven.Maven3Builder.call(Maven3Builder.java:129)
	at hudson.maven.Maven3Builder.call(Maven3Builder.java:67)
	at hudson.remoting.UserRequest.perform(UserRequest.java:118)
	at hudson.remoting.UserRequest.perform(UserRequest.java:48)
	at hudson.remoting.Request$2.run(Request.java:326)
	at hudson.remoting.InterceptingExecutorService$1.call(InterceptingExecutorService.java:72)
	at java.util.concurrent.FutureTask$Sync.innerRun(FutureTask.java:303)
	at java.util.concurrent.FutureTask.run(FutureTask.java:138)
	at java.util.concurrent.ThreadPoolExecutor$Worker.runTask(ThreadPoolExecutor.java:895)
	at java.util.concurrent.ThreadPoolExecutor$Worker.run(ThreadPoolExecutor.java:918)
	at java.lang.Thread.run(Thread.java:662)
Caused by: hudson.remoting.RemotingSystemException: java.io.StreamCorruptedException: invalid
handle value: 007E6010
	at hudson.remoting.RemoteInvocationHandler.invoke(RemoteInvocationHandler.java:183)
	at com.sun.proxy.$Proxy7.setExecutedMojos(Unknown Source)
	at hudson.maven.MavenBuildProxy$Filter.setExecutedMojos(MavenBuildProxy.java:243)
	at hudson.maven.Maven3Builder$MavenExecutionListener.recordMojoEnded(Maven3Builder.java:574)
	at hudson.maven.Maven3Builder$MavenExecutionListener.mojoSucceeded(Maven3Builder.java:560)
	at org.apache.maven.lifecycle.internal.DefaultExecutionEventCatapult.fire(DefaultExecutionEventCatapult.java:87)
	at org.apache.maven.lifecycle.internal.DefaultExecutionEventCatapult.fire(DefaultExecutionEventCatapult.java:42)
	at org.apache.maven.lifecycle.internal.MojoExecutor.execute(MojoExecutor.java:228)
	at org.apache.maven.lifecycle.internal.MojoExecutor.execute(MojoExecutor.java:153)
	at org.apache.maven.lifecycle.internal.MojoExecutor.execute(MojoExecutor.java:145)
	at org.apache.maven.lifecycle.internal.LifecycleModuleBuilder.buildProject(LifecycleModuleBuilder.java:84)
	... 28 more
Caused by: java.io.StreamCorruptedException: invalid handle value: 007E6010
	at java.io.ObjectInputStream.readHandle(ObjectInputStream.java:1452)
	at java.io.ObjectInputStream.readClassDesc(ObjectInputStream.java:1509)
	at java.io.ObjectInputStream.readOrdinaryObject(ObjectInputStream.java:1769)
	at java.io.ObjectInputStream.readObject0(ObjectInputStream.java:1348)
	at java.io.ObjectInputStream.readArray(ObjectInputStream.java:1704)
	at java.io.ObjectInputStream.readObject0(ObjectInputStream.java:1342)
	at java.io.ObjectInputStream.defaultReadFields(ObjectInputStream.java:1989)
	at java.io.ObjectInputStream.defaultReadObject(ObjectInputStream.java:499)
	at java.lang.Throwable.readObject(Throwable.java:913)
	at sun.reflect.GeneratedMethodAccessor129.invoke(Unknown Source)
	at sun.reflect.DelegatingMethodAccessorImpl.invoke(DelegatingMethodAccessorImpl.java:43)
	at java.lang.reflect.Method.invoke(Method.java:606)
	at java.io.ObjectStreamClass.invokeReadObject(ObjectStreamClass.java:1017)
	at java.io.ObjectInputStream.readSerialData(ObjectInputStream.java:1891)
	at java.io.ObjectInputStream.readOrdinaryObject(ObjectInputStream.java:1796)
	at java.io.ObjectInputStream.readObject0(ObjectInputStream.java:1348)
	at java.io.ObjectInputStream.defaultReadFields(ObjectInputStream.java:1989)
	at java.io.ObjectInputStream.readSerialData(ObjectInputStream.java:1913)
	at java.io.ObjectInputStream.readOrdinaryObject(ObjectInputStream.java:1796)
	at java.io.ObjectInputStream.readObject0(ObjectInputStream.java:1348)
	at java.io.ObjectInputStream.readObject(ObjectInputStream.java:370)
	at hudson.remoting.UserRequest.deserialize(UserRequest.java:182)
	at hudson.remoting.UserRequest.perform(UserRequest.java:98)
	at hudson.remoting.UserRequest.perform(UserRequest.java:48)
	at hudson.remoting.Request$2.run(Request.java:326)
	at hudson.remoting.InterceptingExecutorService$1.call(InterceptingExecutorService.java:72)
	at java.util.concurrent.FutureTask$Sync.innerRun(FutureTask.java:334)
	at java.util.concurrent.FutureTask.run(FutureTask.java:166)
	at java.util.concurrent.ThreadPoolExecutor.runWorker(ThreadPoolExecutor.java:1145)
	at java.util.concurrent.ThreadPoolExecutor$Worker.run(ThreadPoolExecutor.java:615)
	at java.lang.Thread.run(Thread.java:724)
Sending e-mails to: commits@hc.apache.org
channel stopped

Mime
View raw message