hc-commits mailing list archives

Site index · List index
Message view « Date » · « Thread »
Top « Date » · « Thread »
From Apache Jenkins Server <jenk...@builds.apache.org>
Subject Build failed in Jenkins: HttpComponents Core #509
Date Fri, 19 Jul 2013 12:21:54 GMT
See <https://builds.apache.org/job/HttpComponents%20Core/509/changes>

Changes:

[olegk] Removed web content

[olegk] Fixed duplicate N&L problem by removing maven-notice-plugin in favor of maven-remote-resource-plugin
included through Apache parent POM

[ggregory] Minor edits from proof-reading (just got started, but done for now).

[ggregory] Proof-reading fix.

------------------------------------------
[...truncated 310 lines...]
Audit done.

[INFO] 
[INFO] --- maven-checkstyle-plugin:2.9.1:checkstyle (validate-main) @ httpcore ---
[INFO] Starting audit...
Audit done.

[INFO] 
[INFO] --- maven-checkstyle-plugin:2.9.1:checkstyle (validate-test) @ httpcore ---
[INFO] Starting audit...
Audit done.

[INFO] 
[INFO] --- maven-checkstyle-plugin:2.9.1:checkstyle (validate-examples) @ httpcore ---
[INFO] Starting audit...
Audit done.

Jul 19, 2013 12:14:48 PM hudson.maven.ExecutedMojo <init>
WARNING: Failed to getClass for org.apache.maven.plugin.source.SourceJarMojo
[INFO] 
[INFO] --- maven-source-plugin:2.2.1:jar (attach-sources) @ httpcore ---
[INFO] Building jar: <https://builds.apache.org/job/HttpComponents%20Core/ws/httpcore-trunk/httpcore/target/httpcore-4.3-beta3-SNAPSHOT-sources.jar>
[INFO] 
[INFO] --- maven-javadoc-plugin:2.9.1:jar (attach-javadocs) @ httpcore ---
[INFO] Fixed Javadoc frame injection vulnerability (CVE-2013-1571) in 1 files.
[INFO] Building jar: <https://builds.apache.org/job/HttpComponents%20Core/ws/httpcore-trunk/httpcore/target/httpcore-4.3-beta3-SNAPSHOT-javadoc.jar>
[INFO] 
[INFO] --- maven-site-plugin:3.3:attach-descriptor (attach-descriptor) @ httpcore ---
[INFO] 
[INFO] --- maven-install-plugin:2.4:install (default-install) @ httpcore ---[INFO] Installing
<https://builds.apache.org/job/HttpComponents%20Core/ws/httpcore-trunk/httpcore/target/httpcore-4.3-beta3-SNAPSHOT.jar>
to /export/home/hudson/hudson-slave/maven-repositories/1/org/apache/httpcomponents/httpcore/4.3-beta3-SNAPSHOT/httpcore-4.3-beta3-SNAPSHOT.jar
[INFO] Installing <https://builds.apache.org/job/HttpComponents%20Core/ws/httpcore-trunk/httpcore/pom.xml>
to /export/home/hudson/hudson-slave/maven-repositories/1/org/apache/httpcomponents/httpcore/4.3-beta3-SNAPSHOT/httpcore-4.3-beta3-SNAPSHOT.pom
[INFO] Installing <https://builds.apache.org/job/HttpComponents%20Core/ws/httpcore-trunk/httpcore/target/httpcore-4.3-beta3-SNAPSHOT-sources.jar>
to /export/home/hudson/hudson-slave/maven-repositories/1/org/apache/httpcomponents/httpcore/4.3-beta3-SNAPSHOT/httpcore-4.3-beta3-SNAPSHOT-sources.jar
[INFO] Installing <https://builds.apache.org/job/HttpComponents%20Core/ws/httpcore-trunk/httpcore/target/httpcore-4.3-beta3-SNAPSHOT-javadoc.jar>
to /export/home/hudson/hudson-slave/maven-repositories/1/org/apache/httpcomponents/httpcore/4.3-beta3-SNAPSHOT/httpcore-4.3-beta3-SNAPSHOT-javadoc.jar

[INFO]                                                                         
[INFO] ------------------------------------------------------------------------
[INFO] Building Apache HttpCore NIO 4.3-beta3-SNAPSHOT
[INFO] ------------------------------------------------------------------------
[INFO] 
[INFO] --- maven-clean-plugin:2.5:clean (default-clean) @ httpcore-nio ---[INFO] Deleting
<https://builds.apache.org/job/HttpComponents%20Core/ws/httpcore-trunk/httpcore-nio/target>

[INFO] 
[INFO] --- maven-checkstyle-plugin:2.9.1:checkstyle (validate) @ httpcore-nio ---
[INFO] Starting audit...
Audit done.

[INFO] 
[INFO] --- maven-checkstyle-plugin:2.9.1:checkstyle (validate-main) @ httpcore-nio ---
[INFO] Starting audit...
Audit done.

[INFO] 
[INFO] --- maven-checkstyle-plugin:2.9.1:checkstyle (validate-test) @ httpcore-nio ---
[INFO] Starting audit...
Audit done.

[INFO] 
[INFO] --- maven-checkstyle-plugin:2.9.1:checkstyle (validate-examples) @ httpcore-nio ---[INFO]
Starting audit...
Audit done.


[INFO] 
[INFO] --- maven-remote-resources-plugin:1.4:process (default) @ httpcore-nio ---
[INFO] 
[INFO] --- buildnumber-maven-plugin:1.2:create (default) @ httpcore-nio ---[INFO] Checking
for local modifications: skipped.
[INFO] Updating project files from SCM: skipped.
[INFO] Executing: /bin/sh -c cd "<https://builds.apache.org/job/HttpComponents%20Core/ws/httpcore-trunk/httpcore-nio">
&& svn --non-interactive info
[INFO] Working directory: <https://builds.apache.org/job/HttpComponents%20Core/ws/httpcore-trunk/httpcore-nio>
[INFO] Storing buildNumber: 1504842 at timestamp: 1374236153240
[INFO] Executing: /bin/sh -c cd "<https://builds.apache.org/job/HttpComponents%20Core/ws/httpcore-trunk/httpcore-nio">
&& svn --non-interactive info
[INFO] Working directory: <https://builds.apache.org/job/HttpComponents%20Core/ws/httpcore-trunk/httpcore-nio>
[INFO] Storing buildScmBranch: trunk

[INFO] 
[INFO] --- maven-resources-plugin:2.6:resources (default-resources) @ httpcore-nio ---[INFO]
Using 'UTF-8' encoding to copy filtered resources.
[INFO] Copying 1 resource
[INFO] Copying 3 resources

[INFO] 
[INFO] --- maven-compiler-plugin:3.1:compile (default-compile) @ httpcore-nio ---
[INFO] Changes detected - recompiling the module!
[INFO] Compiling 189 source files to <https://builds.apache.org/job/HttpComponents%20Core/ws/httpcore-trunk/httpcore-nio/target/classes>
[INFO] 
[INFO] --- maven-resources-plugin:2.6:testResources (default-testResources) @ httpcore-nio
---[INFO] Using 'UTF-8' encoding to copy filtered resources.
[INFO] Copying 1 resource
[INFO] Copying 3 resources

[INFO] 
[INFO] --- maven-compiler-plugin:3.1:testCompile (default-testCompile) @ httpcore-nio ---
[INFO] Changes detected - recompiling the module!
[INFO] Compiling 71 source files to <https://builds.apache.org/job/HttpComponents%20Core/ws/httpcore-trunk/httpcore-nio/target/test-classes>
[INFO] 
[INFO] --- maven-surefire-plugin:2.15:test (default-test) @ httpcore-nio ---[INFO] Surefire
report directory: <https://builds.apache.org/job/HttpComponents%20Core/ws/httpcore-trunk/httpcore-nio/target/surefire-reports>

-------------------------------------------------------
 T E S T S
-------------------------------------------------------

Running org.apache.http.impl.nio.reactor.TestDefaultIOReactorsSSL
Tests run: 4, Failures: 0, Errors: 0, Skipped: 0, Time elapsed: 11.918 sec - in org.apache.http.impl.nio.reactor.TestDefaultIOReactorsSSL
Running org.apache.http.impl.nio.reactor.TestDefaultIOReactors
Tests run: 4, Failures: 0, Errors: 0, Skipped: 0, Time elapsed: 10.125 sec - in org.apache.http.impl.nio.reactor.TestDefaultIOReactors
Running org.apache.http.impl.nio.reactor.ExceptionEventTest
Tests run: 3, Failures: 0, Errors: 0, Skipped: 0, Time elapsed: 0 sec - in org.apache.http.impl.nio.reactor.ExceptionEventTest
Running org.apache.http.impl.nio.reactor.TestBaseIOReactorSSL
Tests run: 1, Failures: 0, Errors: 0, Skipped: 0, Time elapsed: 0.236 sec - in org.apache.http.impl.nio.reactor.TestBaseIOReactorSSL
Running org.apache.http.impl.nio.reactor.TestSessionInOutBuffers
Tests run: 38, Failures: 0, Errors: 0, Skipped: 0, Time elapsed: 0.463 sec - in org.apache.http.impl.nio.reactor.TestSessionInOutBuffers
Running org.apache.http.impl.nio.reactor.TestDefaultListeningIOReactor
Tests run: 3, Failures: 0, Errors: 0, Skipped: 0, Time elapsed: 0.669 sec - in org.apache.http.impl.nio.reactor.TestDefaultListeningIOReactor
Running org.apache.http.impl.nio.codecs.TestChunkEncoder
Tests run: 8, Failures: 0, Errors: 0, Skipped: 0, Time elapsed: 0.685 sec - in org.apache.http.impl.nio.codecs.TestChunkEncoder
Running org.apache.http.impl.nio.codecs.TestIdentityDecoder
Tests run: 8, Failures: 0, Errors: 0, Skipped: 0, Time elapsed: 0.167 sec - in org.apache.http.impl.nio.codecs.TestIdentityDecoder
Running org.apache.http.impl.nio.codecs.TestLengthDelimitedEncoder
Tests run: 23, Failures: 0, Errors: 0, Skipped: 0, Time elapsed: 0.167 sec - in org.apache.http.impl.nio.codecs.TestLengthDelimitedEncoder
Running org.apache.http.impl.nio.codecs.TestLengthDelimitedDecoder
Tests run: 15, Failures: 0, Errors: 0, Skipped: 0, Time elapsed: 0.005 sec - in org.apache.http.impl.nio.codecs.TestLengthDelimitedDecoder
Running org.apache.http.impl.nio.codecs.TestChunkDecoder
Tests run: 14, Failures: 0, Errors: 0, Skipped: 0, Time elapsed: 0.005 sec - in org.apache.http.impl.nio.codecs.TestChunkDecoder
Running org.apache.http.impl.nio.codecs.TestIdentityEncoder
Tests run: 20, Failures: 0, Errors: 0, Skipped: 0, Time elapsed: 0.12 sec - in org.apache.http.impl.nio.codecs.TestIdentityEncoder
Running org.apache.http.impl.nio.codecs.TestHttpMessageParser
Tests run: 17, Failures: 0, Errors: 0, Skipped: 0, Time elapsed: 0.001 sec - in org.apache.http.impl.nio.codecs.TestHttpMessageParser
Running org.apache.http.impl.nio.TestDefaultNHttpServerConnection
Tests run: 17, Failures: 0, Errors: 0, Skipped: 0, Time elapsed: 0.188 sec - in org.apache.http.impl.nio.TestDefaultNHttpServerConnection
Running org.apache.http.impl.nio.TestNHttpConnectionBase
Tests run: 14, Failures: 0, Errors: 0, Skipped: 0, Time elapsed: 0.029 sec - in org.apache.http.impl.nio.TestNHttpConnectionBase
Running org.apache.http.impl.nio.TestDefaultNHttpClientConnection
Tests run: 17, Failures: 0, Errors: 0, Skipped: 0, Time elapsed: 0.075 sec - in org.apache.http.impl.nio.TestDefaultNHttpClientConnection
Running org.apache.http.impl.nio.TestContentChannel
Tests run: 2, Failures: 0, Errors: 0, Skipped: 0, Time elapsed: 0.026 sec - in org.apache.http.impl.nio.TestContentChannel
Running org.apache.http.impl.nio.pool.TestBasicNIOConnPool
Tests run: 4, Failures: 0, Errors: 0, Skipped: 0, Time elapsed: 0.329 sec - in org.apache.http.impl.nio.pool.TestBasicNIOConnPool
Running org.apache.http.nio.util.TestBuffers
Tests run: 7, Failures: 0, Errors: 0, Skipped: 0, Time elapsed: 0.398 sec - in org.apache.http.nio.util.TestBuffers
Running org.apache.http.nio.integration.TestPipelining
Tests run: 2, Failures: 0, Errors: 0, Skipped: 0, Time elapsed: 0.142 sec - in org.apache.http.nio.integration.TestPipelining
Running org.apache.http.nio.integration.TestHttpsAsyncTimeout
Tests run: 1, Failures: 0, Errors: 0, Skipped: 0, Time elapsed: 1.059 sec - in org.apache.http.nio.integration.TestHttpsAsyncTimeout
Running org.apache.http.nio.integration.TestHttpAsyncHandlers
Tests run: 15, Failures: 0, Errors: 0, Skipped: 0, Time elapsed: 16.054 sec - in org.apache.http.nio.integration.TestHttpAsyncHandlers
Running org.apache.http.nio.integration.TestHttpAsyncHandlerCancellable
Tests run: 2, Failures: 0, Errors: 0, Skipped: 0, Time elapsed: 0.522 sec - in org.apache.http.nio.integration.TestHttpAsyncHandlerCancellable
Running org.apache.http.nio.integration.TestTruncatedChunks
Tests run: 2, Failures: 0, Errors: 0, Skipped: 0, Time elapsed: 0.016 sec - in org.apache.http.nio.integration.TestTruncatedChunks
Running org.apache.http.nio.integration.TestHttpAsyncPrematureTermination
Tests run: 3, Failures: 0, Errors: 0, Skipped: 0, Time elapsed: 0.263 sec - in org.apache.http.nio.integration.TestHttpAsyncPrematureTermination
Running org.apache.http.nio.integration.TestHttpsAsyncHandlers
Tests run: 15, Failures: 0, Errors: 0, Skipped: 0, Time elapsed: 24.273 sec - in org.apache.http.nio.integration.TestHttpsAsyncHandlers
Running org.apache.http.nio.integration.TestAsyncNHttpHandlers
#
# An unexpected error has been detected by HotSpot Virtual Machine:
#
#  SIGBUS (0xa) at pc=0xfef4443a, pid=14370, tid=1160
#
# Java VM: Java HotSpot(TM) Server VM (1.5.0_22-b03 mixed mode)
# Problematic frame:
# C  [libc.so.1+0xa443a]
#
# An error report file with more information is saved as hs_err_pid14370.log
#
# If you would like to submit a bug report, please visit:
#   http://java.sun.com/webapps/bugreport/crash.jsp
#
Abort - core dumped

Results :

Tests run: 259, Failures: 0, Errors: 0, Skipped: 0

[JENKINS] Recording test results
[INFO] ------------------------------------------------------------------------
[INFO] Reactor Summary:
[INFO] 
[INFO] Apache HttpComponents Core ........................ SUCCESS [3:18.876s]
[INFO] Apache HttpCore ................................... SUCCESS [4:04.808s]
[INFO] Apache HttpCore NIO ............................... FAILURE [3:24.059s]
[INFO] Apache HttpCore OSGi bundle ....................... SKIPPED
[INFO] Apache HttpCore Benchmarking Tool ................. SKIPPED
[INFO] ------------------------------------------------------------------------
[INFO] BUILD FAILURE
[INFO] ------------------------------------------------------------------------
[INFO] Total time: 11:15.933s
[INFO] Finished at: Fri Jul 19 12:18:45 GMT+00:00 2013
[INFO] Final Memory: 32M/199M
[INFO] ------------------------------------------------------------------------
[JENKINS] Archiving <https://builds.apache.org/job/HttpComponents%20Core/ws/httpcore-trunk/httpcore-nio/pom.xml>
to /home/hudson/hudson/jobs/HttpComponents Core/modules/org.apache.httpcomponents$httpcore-nio/builds/2013-07-19_12-05-19/archive/org.apache.httpcomponents/httpcore-nio/4.3-beta3-SNAPSHOT/httpcore-nio-4.3-beta3-SNAPSHOT.pom
[JENKINS] Archiving <https://builds.apache.org/job/HttpComponents%20Core/ws/httpcore-trunk/httpcore/pom.xml>
to /home/hudson/hudson/jobs/HttpComponents Core/modules/org.apache.httpcomponents$httpcore/builds/2013-07-19_12-05-18/archive/org.apache.httpcomponents/httpcore/4.3-beta3-SNAPSHOT/httpcore-4.3-beta3-SNAPSHOT.pom
[JENKINS] Archiving <https://builds.apache.org/job/HttpComponents%20Core/ws/httpcore-trunk/httpcore/target/httpcore-4.3-beta3-SNAPSHOT.jar>
to /home/hudson/hudson/jobs/HttpComponents Core/modules/org.apache.httpcomponents$httpcore/builds/2013-07-19_12-05-18/archive/org.apache.httpcomponents/httpcore/4.3-beta3-SNAPSHOT/httpcore-4.3-beta3-SNAPSHOT.jar
[JENKINS] Archiving <https://builds.apache.org/job/HttpComponents%20Core/ws/httpcore-trunk/httpcore/target/httpcore-4.3-beta3-SNAPSHOT-sources.jar>
to /home/hudson/hudson/jobs/HttpComponents Core/modules/org.apache.httpcomponents$httpcore/builds/2013-07-19_12-05-18/archive/org.apache.httpcomponents/httpcore/4.3-beta3-SNAPSHOT/httpcore-4.3-beta3-SNAPSHOT-sources.jar
[JENKINS] Archiving <https://builds.apache.org/job/HttpComponents%20Core/ws/httpcore-trunk/httpcore/target/httpcore-4.3-beta3-SNAPSHOT-javadoc.jar>
to /home/hudson/hudson/jobs/HttpComponents Core/modules/org.apache.httpcomponents$httpcore/builds/2013-07-19_12-05-18/archive/org.apache.httpcomponents/httpcore/4.3-beta3-SNAPSHOT/httpcore-4.3-beta3-SNAPSHOT-javadoc.jar
[JENKINS] Archiving <https://builds.apache.org/job/HttpComponents%20Core/ws/httpcore-trunk/httpcore-osgi/pom.xml>
to /home/hudson/hudson/jobs/HttpComponents Core/modules/org.apache.httpcomponents$httpcore-osgi/builds/2013-07-19_12-05-21/archive/org.apache.httpcomponents/httpcore-osgi/4.3-beta3-SNAPSHOT/httpcore-osgi-4.3-beta3-SNAPSHOT.pom
[JENKINS] Archiving <https://builds.apache.org/job/HttpComponents%20Core/ws/httpcore-trunk/httpcore-ab/pom.xml>
to /home/hudson/hudson/jobs/HttpComponents Core/modules/org.apache.httpcomponents$httpcore-ab/builds/2013-07-19_12-05-22/archive/org.apache.httpcomponents/httpcore-ab/4.3-beta3-SNAPSHOT/httpcore-ab-4.3-beta3-SNAPSHOT.pom
[JENKINS] Archiving <https://builds.apache.org/job/HttpComponents%20Core/ws/httpcore-trunk/pom.xml>
to /home/hudson/hudson/jobs/HttpComponents Core/modules/org.apache.httpcomponents$httpcomponents-core/builds/2013-07-19_12-05-17/archive/org.apache.httpcomponents/httpcomponents-core/4.3-beta3-SNAPSHOT/httpcomponents-core-4.3-beta3-SNAPSHOT.pom
Waiting for Jenkins to finish collecting data
mavenExecutionResult exceptions not empty
message : Failed to execute goal org.apache.maven.plugins:maven-surefire-plugin:2.15:test
(default-test) on project httpcore-nio: Execution default-test of goal org.apache.maven.plugins:maven-surefire-plugin:2.15:test
failed: The forked VM terminated without saying properly goodbye. VM crash or System.exit
called ?
Command was/bin/sh -c cd "<https://builds.apache.org/job/HttpComponents%20Core/ws/httpcore-trunk/httpcore-nio">
&& /zonestorage/hudson_solaris/home/hudson/tools/java/jdk1.5.0_22/jre/bin/java -jar
'<https://builds.apache.org/job/HttpComponents%20Core/ws/httpcore-trunk/httpcore-nio/target/surefire/surefirebooter1162423179703037216.jar'>
'<https://builds.apache.org/job/HttpComponents%20Core/ws/httpcore-trunk/httpcore-nio/target/surefire/surefire1608143043811057629tmp'>
'<https://builds.apache.org/job/HttpComponents%20Core/ws/httpcore-trunk/httpcore-nio/target/surefire/surefire_14422717017651331826tmp'>
cause : Execution default-test of goal org.apache.maven.plugins:maven-surefire-plugin:2.15:test
failed: The forked VM terminated without saying properly goodbye. VM crash or System.exit
called ?
Command was/bin/sh -c cd "<https://builds.apache.org/job/HttpComponents%20Core/ws/httpcore-trunk/httpcore-nio">
&& /zonestorage/hudson_solaris/home/hudson/tools/java/jdk1.5.0_22/jre/bin/java -jar
'<https://builds.apache.org/job/HttpComponents%20Core/ws/httpcore-trunk/httpcore-nio/target/surefire/surefirebooter1162423179703037216.jar'>
'<https://builds.apache.org/job/HttpComponents%20Core/ws/httpcore-trunk/httpcore-nio/target/surefire/surefire1608143043811057629tmp'>
'<https://builds.apache.org/job/HttpComponents%20Core/ws/httpcore-trunk/httpcore-nio/target/surefire/surefire_14422717017651331826tmp'>
Stack trace : 
org.apache.maven.lifecycle.LifecycleExecutionException: Failed to execute goal org.apache.maven.plugins:maven-surefire-plugin:2.15:test
(default-test) on project httpcore-nio: Execution default-test of goal org.apache.maven.plugins:maven-surefire-plugin:2.15:test
failed: The forked VM terminated without saying properly goodbye. VM crash or System.exit
called ?
Command was/bin/sh -c cd "<https://builds.apache.org/job/HttpComponents%20Core/ws/httpcore-trunk/httpcore-nio">
&& /zonestorage/hudson_solaris/home/hudson/tools/java/jdk1.5.0_22/jre/bin/java -jar
'<https://builds.apache.org/job/HttpComponents%20Core/ws/httpcore-trunk/httpcore-nio/target/surefire/surefirebooter1162423179703037216.jar'>
'<https://builds.apache.org/job/HttpComponents%20Core/ws/httpcore-trunk/httpcore-nio/target/surefire/surefire1608143043811057629tmp'>
'<https://builds.apache.org/job/HttpComponents%20Core/ws/httpcore-trunk/httpcore-nio/target/surefire/surefire_14422717017651331826tmp'>
	at org.apache.maven.lifecycle.internal.MojoExecutor.execute(MojoExecutor.java:225)
	at org.apache.maven.lifecycle.internal.MojoExecutor.execute(MojoExecutor.java:153)
	at org.apache.maven.lifecycle.internal.MojoExecutor.execute(MojoExecutor.java:145)
	at org.apache.maven.lifecycle.internal.LifecycleModuleBuilder.buildProject(LifecycleModuleBuilder.java:84)
	at org.apache.maven.lifecycle.internal.LifecycleModuleBuilder.buildProject(LifecycleModuleBuilder.java:59)
	at org.apache.maven.lifecycle.internal.LifecycleStarter.singleThreadedBuild(LifecycleStarter.java:183)
	at org.apache.maven.lifecycle.internal.LifecycleStarter.execute(LifecycleStarter.java:161)
	at org.apache.maven.DefaultMaven.doExecute(DefaultMaven.java:319)
	at org.apache.maven.DefaultMaven.execute(DefaultMaven.java:156)
	at org.jvnet.hudson.maven3.launcher.Maven3Launcher.main(Maven3Launcher.java:79)
	at sun.reflect.NativeMethodAccessorImpl.invoke0(Native Method)
	at sun.reflect.NativeMethodAccessorImpl.invoke(NativeMethodAccessorImpl.java:39)
	at sun.reflect.DelegatingMethodAccessorImpl.invoke(DelegatingMethodAccessorImpl.java:25)
	at java.lang.reflect.Method.invoke(Method.java:592)
	at org.codehaus.plexus.classworlds.launcher.Launcher.launchStandard(Launcher.java:329)
	at org.codehaus.plexus.classworlds.launcher.Launcher.launch(Launcher.java:239)
	at org.jvnet.hudson.maven3.agent.Maven3Main.launch(Maven3Main.java:158)
	at hudson.maven.Maven3Builder.call(Maven3Builder.java:100)
	at hudson.maven.Maven3Builder.call(Maven3Builder.java:66)
	at hudson.remoting.UserRequest.perform(UserRequest.java:118)
	at hudson.remoting.UserRequest.perform(UserRequest.java:48)
	at hudson.remoting.Request$2.run(Request.java:326)
	at hudson.remoting.InterceptingExecutorService$1.call(InterceptingExecutorService.java:72)
	at java.util.concurrent.FutureTask$Sync.innerRun(FutureTask.java:269)
	at java.util.concurrent.FutureTask.run(FutureTask.java:123)
	at java.util.concurrent.ThreadPoolExecutor$Worker.runTask(ThreadPoolExecutor.java:651)
	at java.util.concurrent.ThreadPoolExecutor$Worker.run(ThreadPoolExecutor.java:676)
	at java.lang.Thread.run(Thread.java:595)
Caused by: org.apache.maven.plugin.PluginExecutionException: Execution default-test of goal
org.apache.maven.plugins:maven-surefire-plugin:2.15:test failed: The forked VM terminated
without saying properly goodbye. VM crash or System.exit called ?
Command was/bin/sh -c cd "<https://builds.apache.org/job/HttpComponents%20Core/ws/httpcore-trunk/httpcore-nio">
&& /zonestorage/hudson_solaris/home/hudson/tools/java/jdk1.5.0_22/jre/bin/java -jar
'<https://builds.apache.org/job/HttpComponents%20Core/ws/httpcore-trunk/httpcore-nio/target/surefire/surefirebooter1162423179703037216.jar'>
'<https://builds.apache.org/job/HttpComponents%20Core/ws/httpcore-trunk/httpcore-nio/target/surefire/surefire1608143043811057629tmp'>
'<https://builds.apache.org/job/HttpComponents%20Core/ws/httpcore-trunk/httpcore-nio/target/surefire/surefire_14422717017651331826tmp'>
	at org.apache.maven.plugin.DefaultBuildPluginManager.executeMojo(DefaultBuildPluginManager.java:110)
	at org.apache.maven.lifecycle.internal.MojoExecutor.execute(MojoExecutor.java:209)
	... 27 more
Caused by: java.lang.RuntimeException: The forked VM terminated without saying properly goodbye.
VM crash or System.exit called ?
Command was/bin/sh -c cd "<https://builds.apache.org/job/HttpComponents%20Core/ws/httpcore-trunk/httpcore-nio">
&& /zonestorage/hudson_solaris/home/hudson/tools/java/jdk1.5.0_22/jre/bin/java -jar
'<https://builds.apache.org/job/HttpComponents%20Core/ws/httpcore-trunk/httpcore-nio/target/surefire/surefirebooter1162423179703037216.jar'>
'<https://builds.apache.org/job/HttpComponents%20Core/ws/httpcore-trunk/httpcore-nio/target/surefire/surefire1608143043811057629tmp'>
'<https://builds.apache.org/job/HttpComponents%20Core/ws/httpcore-trunk/httpcore-nio/target/surefire/surefire_14422717017651331826tmp'>
	at org.apache.maven.plugin.surefire.booterclient.ForkStarter.fork(ForkStarter.java:485)
	at org.apache.maven.plugin.surefire.booterclient.ForkStarter.fork(ForkStarter.java:352)
	at org.apache.maven.plugin.surefire.booterclient.ForkStarter.run(ForkStarter.java:158)
	at org.apache.maven.plugin.surefire.AbstractSurefireMojo.executeProvider(AbstractSurefireMojo.java:883)
	at org.apache.maven.plugin.surefire.AbstractSurefireMojo.executeAfterPreconditionsChecked(AbstractSurefireMojo.java:747)
	at org.apache.maven.plugin.surefire.AbstractSurefireMojo.execute(AbstractSurefireMojo.java:645)
	at org.apache.maven.plugin.DefaultBuildPluginManager.executeMojo(DefaultBuildPluginManager.java:101)
	... 28 more
Sending e-mails to: commits@hc.apache.org
channel stopped

Mime
View raw message