hc-commits mailing list archives

Site index · List index
Message view « Date » · « Thread »
Top « Date » · « Thread »
From Apache Jenkins Server <jenk...@builds.apache.org>
Subject Build failed in Jenkins: HttpComponents Core #504
Date Fri, 05 Jul 2013 12:20:24 GMT
See <https://builds.apache.org/job/HttpComponents%20Core/504/changes>

Changes:

[olegk] Extended default connection factories; added sections on blocking and non-blocking
connection factories to the 'advanced' chapter of the HttpCore tutorial

------------------------------------------
Started by an SCM change
Building remotely on solaris1 in workspace <https://builds.apache.org/job/HttpComponents%20Core/ws/>
Updating http://svn.apache.org/repos/asf/httpcomponents/httpcore/trunk
U         src/docbkx/advanced.xml
AU        httpcore/src/main/java/org/apache/http/impl/DefaultBHttpServerConnectionFactory.java
U         httpcore/src/main/java/org/apache/http/impl/pool/BasicConnFactory.java
AU        httpcore/src/main/java/org/apache/http/impl/DefaultBHttpClientConnectionFactory.java
AU        httpcore/src/main/java/org/apache/http/HttpConnectionFactory.java
U         httpcore/src/examples/org/apache/http/examples/ElementalHttpServer.java
U         httpcore/src/examples/org/apache/http/examples/ElementalPoolingHttpGet.java
U         httpcore-nio/src/main/java/org/apache/http/impl/nio/DefaultNHttpServerConnectionFactory.java
U         httpcore-nio/src/main/java/org/apache/http/impl/nio/DefaultNHttpClientConnectionFactory.java
U         httpcore-nio/src/main/java/org/apache/http/impl/nio/SSLNHttpServerConnectionFactory.java
U         httpcore-nio/src/main/java/org/apache/http/impl/nio/SSLNHttpClientConnectionFactory.java
U         httpcore-nio/src/main/java/org/apache/http/impl/nio/pool/BasicNIOConnFactory.java
At revision 1499980
Parsing POMs
[httpcore-trunk] $ /home/hudson/tools/java/latest1.5/bin/java -cp /export/home/hudson/hudson-slave/maven3-agent.jar:/home/hudson/tools/maven/apache-maven-3.0.3/boot/plexus-classworlds-2.4.jar
org.jvnet.hudson.maven3.agent.Maven3Main /home/hudson/tools/maven/apache-maven-3.0.3 /zonestorage/hudson_solaris/home/hudson/hudson-slave/slave.jar
/export/home/hudson/hudson-slave/maven3-interceptor.jar 60292
<===[JEchannel started
NKINS REMOTING CAPACITY]===>   log4j:WARN No appenders could be found for logger (org.apache.commons.beanutils.converters.BooleanConverter).
log4j:WARN Please initialize the log4j system properly.
Executing Maven:  -B -f <https://builds.apache.org/job/HttpComponents%20Core/ws/httpcore-trunk/pom.xml>
-Dmaven.repo.local=/export/home/hudson/hudson-slave/maven-repositories/0 clean install
[INFO] Scanning for projects...
[WARNING] 
[WARNING] Some problems were encountered while building the effective model for org.apache.httpcomponents:httpcore-osgi:bundle:4.3-beta3-SNAPSHOT
[WARNING] 'build.plugins.plugin.version' for com.atlassian.maven.plugins:maven-clover2-plugin
is missing. @ line 72, column 15
[WARNING] 'reporting.plugins.plugin.version' for com.atlassian.maven.plugins:maven-clover2-plugin
is missing. @ line 92, column 15
[WARNING] 
[WARNING] It is highly recommended to fix these problems because they threaten the stability
of your build.
[WARNING] 
[WARNING] For this reason, future Maven versions might no longer support building such malformed
projects.
[WARNING] 
[INFO] ------------------------------------------------------------------------
[INFO] Reactor Build Order:
[INFO] 
[INFO] HttpComponents Core
[INFO] HttpCore
[INFO] HttpCore NIO
[INFO] HttpCore OSGi bundle
[INFO] HttpCore AB clone
[INFO]                                                                         
[INFO] ------------------------------------------------------------------------
[INFO] Building HttpComponents Core 4.3-beta3-SNAPSHOT
[INFO] ------------------------------------------------------------------------
[INFO] 
[INFO] --- maven-clean-plugin:2.5:clean (default-clean) @ httpcomponents-core ---[INFO] Deleting
<https://builds.apache.org/job/HttpComponents%20Core/ws/httpcore-trunk/target>

[INFO] 
[INFO] --- maven-checkstyle-plugin:2.9.1:checkstyle (validate) @ httpcomponents-core ---
[INFO] 
[INFO] --- maven-checkstyle-plugin:2.9.1:checkstyle (validate-main) @ httpcomponents-core
---
[INFO] Starting audit...
Audit done.

[INFO] 
[INFO] --- maven-checkstyle-plugin:2.9.1:checkstyle (validate-test) @ httpcomponents-core
---
[INFO] 
[INFO] --- maven-checkstyle-plugin:2.9.1:checkstyle (validate-examples) @ httpcomponents-core
---
[INFO] 
[INFO] --- maven-remote-resources-plugin:1.4:process (default) @ httpcomponents-core ---
[INFO] 
[INFO] --- maven-notice-plugin:0.0.2:generate (attach-notice-license) @ httpcomponents-core
---
[INFO] 
[INFO] --- buildnumber-maven-plugin:1.2:create (default) @ httpcomponents-core ---
[INFO] Checking for local modifications: skipped.
[INFO] Updating project files from SCM: skipped.
[INFO] Executing: /bin/sh -c cd "<https://builds.apache.org/job/HttpComponents%20Core/ws/httpcore-trunk">
&& svn --non-interactive info
[INFO] Working directory: <https://builds.apache.org/job/HttpComponents%20Core/ws/httpcore-trunk>
[INFO] Storing buildNumber: 1499976 at timestamp: 1373026648348
[INFO] Executing: /bin/sh -c cd "<https://builds.apache.org/job/HttpComponents%20Core/ws/httpcore-trunk">
&& svn --non-interactive info
[INFO] Working directory: <https://builds.apache.org/job/HttpComponents%20Core/ws/httpcore-trunk>
[INFO] Storing buildScmBranch: trunk
[INFO] 
[INFO] --- maven-checkstyle-plugin:2.9.1:checkstyle (validate) @ httpcomponents-core ---
[INFO] 
[INFO] --- maven-checkstyle-plugin:2.9.1:checkstyle (validate-main) @ httpcomponents-core
---[INFO] Starting audit...
Audit done.


[INFO] 
[INFO] --- maven-checkstyle-plugin:2.9.1:checkstyle (validate-test) @ httpcomponents-core
---
[INFO] 
[INFO] --- maven-checkstyle-plugin:2.9.1:checkstyle (validate-examples) @ httpcomponents-core
---
Jul 5, 2013 12:17:39 PM hudson.maven.ExecutedMojo <init>
WARNING: Failed to getClass for org.apache.maven.plugin.source.SourceJarMojo
[INFO] 
[INFO] --- maven-source-plugin:2.2.1:jar (attach-sources) @ httpcomponents-core ---
[INFO] 
[INFO] --- maven-javadoc-plugin:2.9.1:jar (attach-javadocs) @ httpcomponents-core ---
[INFO] Not executing Javadoc as the project is not a Java classpath-capable package
[INFO] 
[INFO] --- maven-site-plugin:3.3:attach-descriptor (attach-descriptor) @ httpcomponents-core
---
[INFO] 
[INFO] --- maven-install-plugin:2.4:install (default-install) @ httpcomponents-core ---
[INFO] Installing <https://builds.apache.org/job/HttpComponents%20Core/ws/httpcore-trunk/pom.xml>
to /export/home/hudson/hudson-slave/maven-repositories/0/org/apache/httpcomponents/httpcomponents-core/4.3-beta3-SNAPSHOT/httpcomponents-core-4.3-beta3-SNAPSHOT.pom
[INFO] Installing <https://builds.apache.org/job/HttpComponents%20Core/ws/httpcore-trunk/target/httpcomponents-core-4.3-beta3-SNAPSHOT-site.xml>
to /export/home/hudson/hudson-slave/maven-repositories/0/org/apache/httpcomponents/httpcomponents-core/4.3-beta3-SNAPSHOT/httpcomponents-core-4.3-beta3-SNAPSHOT-site.xml
[INFO]                                                                         
[INFO] ------------------------------------------------------------------------
[INFO] Building HttpCore 4.3-beta3-SNAPSHOT
[INFO] ------------------------------------------------------------------------
[INFO] 
[INFO] --- maven-clean-plugin:2.5:clean (default-clean) @ httpcore ---
[INFO] Deleting <https://builds.apache.org/job/HttpComponents%20Core/ws/httpcore-trunk/httpcore/target>
[INFO] 
[INFO] --- maven-checkstyle-plugin:2.9.1:checkstyle (validate) @ httpcore ---
[INFO] Starting audit...
Audit done.

[INFO] 
[INFO] --- maven-checkstyle-plugin:2.9.1:checkstyle (validate-main) @ httpcore ---
[INFO] Starting audit...
Audit done.

[INFO] 
[INFO] --- maven-checkstyle-plugin:2.9.1:checkstyle (validate-test) @ httpcore ---
[INFO] Starting audit...
Audit done.

[INFO] 
[INFO] --- maven-checkstyle-plugin:2.9.1:checkstyle (validate-examples) @ httpcore ---
[INFO] Starting audit...
Audit done.

[INFO] 
[INFO] --- maven-remote-resources-plugin:1.4:process (default) @ httpcore ---
[INFO] 
[INFO] --- maven-notice-plugin:0.0.2:generate (attach-notice-license) @ httpcore ---[INFO]
Generating NOTICE and LICENSE resources

[INFO] 
[INFO] --- buildnumber-maven-plugin:1.2:create (default) @ httpcore ---[INFO] Checking for
local modifications: skipped.
[INFO] Updating project files from SCM: skipped.
[INFO] Executing: /bin/sh -c cd "<https://builds.apache.org/job/HttpComponents%20Core/ws/httpcore-trunk/httpcore">
&& svn --non-interactive info
[INFO] Working directory: <https://builds.apache.org/job/HttpComponents%20Core/ws/httpcore-trunk/httpcore>

[INFO] Storing buildNumber: 1499976 at timestamp: 1373026724956
[INFO] Executing: /bin/sh -c cd "<https://builds.apache.org/job/HttpComponents%20Core/ws/httpcore-trunk/httpcore">
&& svn --non-interactive info
[INFO] Working directory: <https://builds.apache.org/job/HttpComponents%20Core/ws/httpcore-trunk/httpcore>
[INFO] Storing buildScmBranch: trunk
[INFO] 
[INFO] --- maven-resources-plugin:2.6:resources (default-resources) @ httpcore ---[INFO] Using
'UTF-8' encoding to copy filtered resources.
[INFO] Copying 1 resource
[INFO] Copying 3 resources
[INFO] Copying 2 resources to META-INF

[INFO] 
[INFO] --- maven-compiler-plugin:3.1:compile (default-compile) @ httpcore ---
[INFO] Changes detected - recompiling the module!
[INFO] Compiling 224 source files to <https://builds.apache.org/job/HttpComponents%20Core/ws/httpcore-trunk/httpcore/target/classes>
[INFO] -------------------------------------------------------------
[ERROR] COMPILATION ERROR : 
[INFO] -------------------------------------------------------------
[ERROR] <https://builds.apache.org/job/HttpComponents%20Core/ws/httpcore-trunk/httpcore/src/main/java/org/apache/http/impl/DefaultBHttpClientConnectionFactory.java>:[88,5]
method does not override a method from its superclass
[ERROR] <https://builds.apache.org/job/HttpComponents%20Core/ws/httpcore-trunk/httpcore/src/main/java/org/apache/http/impl/DefaultBHttpServerConnectionFactory.java>:[88,5]
method does not override a method from its superclass
[INFO] 2 errors 
[INFO] -------------------------------------------------------------
[INFO] ------------------------------------------------------------------------
[INFO] Reactor Summary:
[INFO] 
[INFO] HttpComponents Core ............................... SUCCESS [5:00.834s]
[INFO] HttpCore .......................................... FAILURE [1:10.362s]
[INFO] HttpCore NIO ...................................... SKIPPED
[INFO] HttpCore OSGi bundle .............................. SKIPPED
[INFO] HttpCore AB clone ................................. SKIPPED
[INFO] ------------------------------------------------------------------------
[INFO] BUILD FAILURE
[INFO] ------------------------------------------------------------------------
[INFO] Total time: 6:40.121s
[INFO] Finished at: Fri Jul 05 12:19:23 GMT+00:00 2013
[INFO] Final Memory: 27M/154M
[INFO] ------------------------------------------------------------------------
[JENKINS] Archiving <https://builds.apache.org/job/HttpComponents%20Core/ws/httpcore-trunk/httpcore-nio/pom.xml>
to /home/hudson/hudson/jobs/HttpComponents Core/modules/org.apache.httpcomponents$httpcore-nio/builds/2013-07-05_12-10-22/archive/org.apache.httpcomponents/httpcore-nio/4.3-beta3-SNAPSHOT/httpcore-nio-4.3-beta3-SNAPSHOT.pom
[JENKINS] Archiving <https://builds.apache.org/job/HttpComponents%20Core/ws/httpcore-trunk/httpcore/pom.xml>
to /home/hudson/hudson/jobs/HttpComponents Core/modules/org.apache.httpcomponents$httpcore/builds/2013-07-05_12-10-21/archive/org.apache.httpcomponents/httpcore/4.3-beta3-SNAPSHOT/httpcore-4.3-beta3-SNAPSHOT.pom
[JENKINS] Archiving <https://builds.apache.org/job/HttpComponents%20Core/ws/httpcore-trunk/httpcore-osgi/pom.xml>
to /home/hudson/hudson/jobs/HttpComponents Core/modules/org.apache.httpcomponents$httpcore-osgi/builds/2013-07-05_12-10-24/archive/org.apache.httpcomponents/httpcore-osgi/4.3-beta3-SNAPSHOT/httpcore-osgi-4.3-beta3-SNAPSHOT.pom
[JENKINS] Archiving <https://builds.apache.org/job/HttpComponents%20Core/ws/httpcore-trunk/httpcore-ab/pom.xml>
to /home/hudson/hudson/jobs/HttpComponents Core/modules/org.apache.httpcomponents$httpcore-ab/builds/2013-07-05_12-10-25/archive/org.apache.httpcomponents/httpcore-ab/4.3-beta3-SNAPSHOT/httpcore-ab-4.3-beta3-SNAPSHOT.pom
[JENKINS] Archiving <https://builds.apache.org/job/HttpComponents%20Core/ws/httpcore-trunk/pom.xml>
to /home/hudson/hudson/jobs/HttpComponents Core/modules/org.apache.httpcomponents$httpcomponents-core/builds/2013-07-05_12-10-20/archive/org.apache.httpcomponents/httpcomponents-core/4.3-beta3-SNAPSHOT/httpcomponents-core-4.3-beta3-SNAPSHOT.pom
[JENKINS] Archiving <https://builds.apache.org/job/HttpComponents%20Core/ws/httpcore-trunk/target/httpcomponents-core-4.3-beta3-SNAPSHOT-site.xml>
to /home/hudson/hudson/jobs/HttpComponents Core/modules/org.apache.httpcomponents$httpcomponents-core/builds/2013-07-05_12-10-20/archive/org.apache.httpcomponents/httpcomponents-core/4.3-beta3-SNAPSHOT/httpcomponents-core-4.3-beta3-SNAPSHOT-site.xml
Waiting for Jenkins to finish collecting data
mavenExecutionResult exceptions not empty
message : Failed to execute goal org.apache.maven.plugins:maven-compiler-plugin:3.1:compile
(default-compile) on project httpcore: Compilation failure
cause : Compilation failure
Stack trace : 
org.apache.maven.lifecycle.LifecycleExecutionException: Failed to execute goal org.apache.maven.plugins:maven-compiler-plugin:3.1:compile
(default-compile) on project httpcore: Compilation failure
	at org.apache.maven.lifecycle.internal.MojoExecutor.execute(MojoExecutor.java:213)
	at org.apache.maven.lifecycle.internal.MojoExecutor.execute(MojoExecutor.java:153)
	at org.apache.maven.lifecycle.internal.MojoExecutor.execute(MojoExecutor.java:145)
	at org.apache.maven.lifecycle.internal.LifecycleModuleBuilder.buildProject(LifecycleModuleBuilder.java:84)
	at org.apache.maven.lifecycle.internal.LifecycleModuleBuilder.buildProject(LifecycleModuleBuilder.java:59)
	at org.apache.maven.lifecycle.internal.LifecycleStarter.singleThreadedBuild(LifecycleStarter.java:183)
	at org.apache.maven.lifecycle.internal.LifecycleStarter.execute(LifecycleStarter.java:161)
	at org.apache.maven.DefaultMaven.doExecute(DefaultMaven.java:319)
	at org.apache.maven.DefaultMaven.execute(DefaultMaven.java:156)
	at org.jvnet.hudson.maven3.launcher.Maven3Launcher.main(Maven3Launcher.java:79)
	at sun.reflect.NativeMethodAccessorImpl.invoke0(Native Method)
	at sun.reflect.NativeMethodAccessorImpl.invoke(NativeMethodAccessorImpl.java:39)
	at sun.reflect.DelegatingMethodAccessorImpl.invoke(DelegatingMethodAccessorImpl.java:25)
	at java.lang.reflect.Method.invoke(Method.java:592)
	at org.codehaus.plexus.classworlds.launcher.Launcher.launchStandard(Launcher.java:329)
	at org.codehaus.plexus.classworlds.launcher.Launcher.launch(Launcher.java:239)
	at org.jvnet.hudson.maven3.agent.Maven3Main.launch(Maven3Main.java:158)
	at hudson.maven.Maven3Builder.call(Maven3Builder.java:100)
	at hudson.maven.Maven3Builder.call(Maven3Builder.java:66)
	at hudson.remoting.UserRequest.perform(UserRequest.java:118)
	at hudson.remoting.UserRequest.perform(UserRequest.java:48)
	at hudson.remoting.Request$2.run(Request.java:326)
	at hudson.remoting.InterceptingExecutorService$1.call(InterceptingExecutorService.java:72)
	at java.util.concurrent.FutureTask$Sync.innerRun(FutureTask.java:269)
	at java.util.concurrent.FutureTask.run(FutureTask.java:123)
	at java.util.concurrent.ThreadPoolExecutor$Worker.runTask(ThreadPoolExecutor.java:651)
	at java.util.concurrent.ThreadPoolExecutor$Worker.run(ThreadPoolExecutor.java:676)
	at java.lang.Thread.run(Thread.java:595)
Caused by: org.apache.maven.plugin.compiler.CompilationFailureException: Compilation failure
	at org.apache.maven.plugin.compiler.AbstractCompilerMojo.execute(AbstractCompilerMojo.java:858)
	at org.apache.maven.plugin.compiler.CompilerMojo.execute(CompilerMojo.java:129)
	at org.apache.maven.plugin.DefaultBuildPluginManager.executeMojo(DefaultBuildPluginManager.java:101)
	at org.apache.maven.lifecycle.internal.MojoExecutor.execute(MojoExecutor.java:209)
	... 27 more
Sending e-mails to: commits@hc.apache.org
channel stopped

Mime
View raw message