hc-commits mailing list archives

Site index · List index
Message view « Date » · « Thread »
Top « Date » · « Thread »
From Apache Jenkins Server <jenk...@builds.apache.org>
Subject Build failed in Jenkins: HttpComponents Client #620
Date Mon, 22 Jul 2013 00:34:53 GMT
See <https://builds.apache.org/job/HttpComponents%20Client/620/changes>

Changes:

[sebb] Javadoc

------------------------------------------
Started by an SCM change
Building remotely on solaris1 in workspace <https://builds.apache.org/job/HttpComponents%20Client/ws/>
Updating http://svn.apache.org/repos/asf/httpcomponents/httpclient/trunk at revision '2013-07-22T00:26:08.300
+0000'
U         httpclient/src/main/java/org/apache/http/impl/client/DefaultHttpRequestRetryHandler.java
At revision 1505551
Parsing POMs
[httpclient-trunk] $ /home/hudson/tools/java/latest1.5/bin/java -cp /export/home/hudson/hudson-slave/maven3-agent.jar:/home/hudson/tools/maven/apache-maven-3.0.3/boot/plexus-classworlds-2.4.jar
org.jvnet.hudson.maven3.agent.Maven3Main /home/hudson/tools/maven/apache-maven-3.0.3 /zonestorage/hudson_solaris/home/hudson/hudson-slave/slave.jar
/export/home/hudson/hudson-slave/maven3-interceptor.jar 49537
<===[JENKINS REMOTIchannel started
NG CAPACITY]===>   log4j:WARN No appenders could be found for logger (org.apache.commons.beanutils.converters.BooleanConverter).
log4j:WARN Please initialize the log4j system properly.
Executing Maven:  -B -f <https://builds.apache.org/job/HttpComponents%20Client/ws/httpclient-trunk/pom.xml>
-Dmaven.repo.local=/export/home/hudson/hudson-slave/maven-repositories/1 clean install
[INFO] Scanning for projects...
[WARNING] 
[WARNING] Some problems were encountered while building the effective model for org.apache.httpcomponents:httpclient-osgi:bundle:4.3-beta3-SNAPSHOT
[WARNING] 'reporting.plugins.plugin.version' for com.atlassian.maven.plugins:maven-clover2-plugin
is missing. @ line 180, column 15
[WARNING] 
[WARNING] It is highly recommended to fix these problems because they threaten the stability
of your build.
[WARNING] 
[WARNING] For this reason, future Maven versions might no longer support building such malformed
projects.
[WARNING] 
[INFO] ------------------------------------------------------------------------
[INFO] Reactor Build Order:
[INFO] 
[INFO] HttpComponents Client
[INFO] HttpClient
[INFO] HttpMime
[INFO] HttpClient Cache
[INFO] Fluent HttpClient
[INFO] HttpClient OSGi bundle
[INFO]                                                                         
[INFO] ------------------------------------------------------------------------
[INFO] Building HttpComponents Client 4.3-beta3-SNAPSHOT
[INFO] ------------------------------------------------------------------------
[INFO] 
[INFO] --- maven-clean-plugin:2.4.1:clean (default-clean) @ httpcomponents-client ---
[INFO] Deleting <https://builds.apache.org/job/HttpComponents%20Client/ws/httpclient-trunk/target>
[INFO] 
[INFO] --- maven-checkstyle-plugin:2.9.1:checkstyle (validate-main) @ httpcomponents-client
---
[INFO] Starting audit...
Audit done.

[INFO] 
[INFO] --- maven-checkstyle-plugin:2.9.1:checkstyle (validate-test) @ httpcomponents-client
---
[INFO] 
[INFO] --- maven-checkstyle-plugin:2.9.1:checkstyle (validate-examples) @ httpcomponents-client
---
[INFO] 
[INFO] --- maven-notice-plugin:0.0.2:generate (attach-notice-license) @ httpcomponents-client
---
[INFO] 
[INFO] --- buildnumber-maven-plugin:1.0:create (default) @ httpcomponents-client ---
[INFO] Checking for local modifications: skipped.
[INFO] Updating project files from SCM: skipped.
[INFO] Executing: /bin/sh -c cd "<https://builds.apache.org/job/HttpComponents%20Client/ws/httpclient-trunk">
&& svn --non-interactive info
[INFO] Working directory: <https://builds.apache.org/job/HttpComponents%20Client/ws/httpclient-trunk>
[INFO] Storing buildNumber: 1505483 at timestamp: 1374453167169
[INFO] Executing: /bin/sh -c cd "<https://builds.apache.org/job/HttpComponents%20Client/ws/httpclient-trunk">
&& svn --non-interactive info
[INFO] Working directory: <https://builds.apache.org/job/HttpComponents%20Client/ws/httpclient-trunk>
[INFO] Storing buildScmBranch: trunk
[INFO] 
[INFO] --- maven-checkstyle-plugin:2.9.1:checkstyle (validate-main) @ httpcomponents-client
---[INFO] Starting audit...
Audit done.


[INFO] 
[INFO] --- maven-checkstyle-plugin:2.9.1:checkstyle (validate-test) @ httpcomponents-client
---
[INFO] 
[INFO] --- maven-checkstyle-plugin:2.9.1:checkstyle (validate-examples) @ httpcomponents-client
---
Jul 22, 2013 12:32:57 AM hudson.maven.ExecutedMojo <init>
WARNING: Failed to getClass for org.apache.maven.plugin.source.SourceJarMojo
[INFO] 
[INFO] --- maven-source-plugin:2.1.2:jar (attach-sources) @ httpcomponents-client ---
[INFO] 
[INFO] --- maven-javadoc-plugin:2.8:jar (attach-javadocs) @ httpcomponents-client ---
[INFO] Not executing Javadoc as the project is not a Java classpath-capable package
[INFO] 
[INFO] --- maven-site-plugin:3.0:attach-descriptor (attach-descriptor) @ httpcomponents-client
---
[INFO] 
[INFO] --- maven-install-plugin:2.3.1:install (default-install) @ httpcomponents-client ---
[INFO] Installing <https://builds.apache.org/job/HttpComponents%20Client/ws/httpclient-trunk/pom.xml>
to /export/home/hudson/hudson-slave/maven-repositories/1/org/apache/httpcomponents/httpcomponents-client/4.3-beta3-SNAPSHOT/httpcomponents-client-4.3-beta3-SNAPSHOT.pom
[INFO] Installing <https://builds.apache.org/job/HttpComponents%20Client/ws/httpclient-trunk/target/httpcomponents-client-4.3-beta3-SNAPSHOT-site.xml>
to /export/home/hudson/hudson-slave/maven-repositories/1/org/apache/httpcomponents/httpcomponents-client/4.3-beta3-SNAPSHOT/httpcomponents-client-4.3-beta3-SNAPSHOT-site.xml
[INFO]                                                                         
[INFO] ------------------------------------------------------------------------
[INFO] Building HttpClient 4.3-beta3-SNAPSHOT
[INFO] ------------------------------------------------------------------------
[INFO] 
[INFO] [INFO] Deleting <https://builds.apache.org/job/HttpComponents%20Client/ws/httpclient-trunk/httpclient/target>
--- maven-clean-plugin:2.4.1:clean (default-clean) @ httpclient ---
[INFO] 
[INFO] --- maven-checkstyle-plugin:2.9.1:checkstyle (validate-main) @ httpclient ---
[INFO] Starting audit...
<https://builds.apache.org/job/HttpComponents%20Client/ws/httpclient-trunk/httpclient/src/main/java/org/apache/http/impl/client/DefaultHttpRequestRetryHandler.java>:70:
Trailing whitespace
<https://builds.apache.org/job/HttpComponents%20Client/ws/httpclient-trunk/httpclient/src/main/java/org/apache/http/impl/client/DefaultHttpRequestRetryHandler.java>:73:
Trailing whitespace
<https://builds.apache.org/job/HttpComponents%20Client/ws/httpclient-trunk/httpclient/src/main/java/org/apache/http/impl/client/DefaultHttpRequestRetryHandler.java>:90:
Trailing whitespace
Audit done.

[INFO] ------------------------------------------------------------------------
[INFO] Reactor Summary:
[INFO] 
[INFO] HttpComponents Client ............................. SUCCESS [3:27.425s]
[INFO] HttpClient ........................................ FAILURE [23.499s]
[INFO] HttpMime .......................................... SKIPPED
[INFO] HttpClient Cache .................................. SKIPPED
[INFO] Fluent HttpClient ................................. SKIPPED
[INFO] HttpClient OSGi bundle ............................ SKIPPED
[INFO] ------------------------------------------------------------------------
[INFO] BUILD FAILURE
[INFO] ------------------------------------------------------------------------
[INFO] Total time: 4:20.828s
[INFO] Finished at: Mon Jul 22 00:33:46 GMT+00:00 2013
[INFO] Final Memory: 20M/184M
[INFO] ------------------------------------------------------------------------
[JENKINS] Archiving <https://builds.apache.org/job/HttpComponents%20Client/ws/httpclient-trunk/httpclient/pom.xml>
to /home/hudson/hudson/jobs/HttpComponents Client/modules/org.apache.httpcomponents$httpclient/builds/2013-07-22_00-27-09/archive/org.apache.httpcomponents/httpclient/4.3-beta3-SNAPSHOT/httpclient-4.3-beta3-SNAPSHOT.pom
[JENKINS] Archiving <https://builds.apache.org/job/HttpComponents%20Client/ws/httpclient-trunk/pom.xml>
to /home/hudson/hudson/jobs/HttpComponents Client/modules/org.apache.httpcomponents$httpcomponents-client/builds/2013-07-22_00-27-07/archive/org.apache.httpcomponents/httpcomponents-client/4.3-beta3-SNAPSHOT/httpcomponents-client-4.3-beta3-SNAPSHOT.pom
[JENKINS] Archiving <https://builds.apache.org/job/HttpComponents%20Client/ws/httpclient-trunk/target/httpcomponents-client-4.3-beta3-SNAPSHOT-site.xml>
to /home/hudson/hudson/jobs/HttpComponents Client/modules/org.apache.httpcomponents$httpcomponents-client/builds/2013-07-22_00-27-07/archive/org.apache.httpcomponents/httpcomponents-client/4.3-beta3-SNAPSHOT/httpcomponents-client-4.3-beta3-SNAPSHOT-site.xml
[JENKINS] Archiving <https://builds.apache.org/job/HttpComponents%20Client/ws/httpclient-trunk/httpclient-osgi/pom.xml>
to /home/hudson/hudson/jobs/HttpComponents Client/modules/org.apache.httpcomponents$httpclient-osgi/builds/2013-07-22_00-27-14/archive/org.apache.httpcomponents/httpclient-osgi/4.3-beta3-SNAPSHOT/httpclient-osgi-4.3-beta3-SNAPSHOT.pom
[JENKINS] Archiving <https://builds.apache.org/job/HttpComponents%20Client/ws/httpclient-trunk/fluent-hc/pom.xml>
to /home/hudson/hudson/jobs/HttpComponents Client/modules/org.apache.httpcomponents$fluent-hc/builds/2013-07-22_00-27-12/archive/org.apache.httpcomponents/fluent-hc/4.3-beta3-SNAPSHOT/fluent-hc-4.3-beta3-SNAPSHOT.pom
[JENKINS] Archiving <https://builds.apache.org/job/HttpComponents%20Client/ws/httpclient-trunk/httpmime/pom.xml>
to /home/hudson/hudson/jobs/HttpComponents Client/modules/org.apache.httpcomponents$httpmime/builds/2013-07-22_00-27-10/archive/org.apache.httpcomponents/httpmime/4.3-beta3-SNAPSHOT/httpmime-4.3-beta3-SNAPSHOT.pom
[JENKINS] Archiving <https://builds.apache.org/job/HttpComponents%20Client/ws/httpclient-trunk/httpclient-cache/pom.xml>
to /home/hudson/hudson/jobs/HttpComponents Client/modules/org.apache.httpcomponents$httpclient-cache/builds/2013-07-22_00-27-11/archive/org.apache.httpcomponents/httpclient-cache/4.3-beta3-SNAPSHOT/httpclient-cache-4.3-beta3-SNAPSHOT.pom
Waiting for Jenkins to finish collecting data
mavenExecutionResult exceptions not empty
message : Failed to execute goal org.apache.maven.plugins:maven-checkstyle-plugin:2.9.1:checkstyle
(validate-main) on project httpclient: An error has occurred in Checkstyle report generation.
cause : An error has occurred in Checkstyle report generation.
Stack trace : 
org.apache.maven.lifecycle.LifecycleExecutionException: Failed to execute goal org.apache.maven.plugins:maven-checkstyle-plugin:2.9.1:checkstyle
(validate-main) on project httpclient: An error has occurred in Checkstyle report generation.
	at org.apache.maven.lifecycle.internal.MojoExecutor.execute(MojoExecutor.java:217)
	at org.apache.maven.lifecycle.internal.MojoExecutor.execute(MojoExecutor.java:153)
	at org.apache.maven.lifecycle.internal.MojoExecutor.execute(MojoExecutor.java:145)
	at org.apache.maven.lifecycle.internal.LifecycleModuleBuilder.buildProject(LifecycleModuleBuilder.java:84)
	at org.apache.maven.lifecycle.internal.LifecycleModuleBuilder.buildProject(LifecycleModuleBuilder.java:59)
	at org.apache.maven.lifecycle.internal.LifecycleStarter.singleThreadedBuild(LifecycleStarter.java:183)
	at org.apache.maven.lifecycle.internal.LifecycleStarter.execute(LifecycleStarter.java:161)
	at org.apache.maven.DefaultMaven.doExecute(DefaultMaven.java:319)
	at org.apache.maven.DefaultMaven.execute(DefaultMaven.java:156)
	at org.jvnet.hudson.maven3.launcher.Maven3Launcher.main(Maven3Launcher.java:79)
	at sun.reflect.NativeMethodAccessorImpl.invoke0(Native Method)
	at sun.reflect.NativeMethodAccessorImpl.invoke(NativeMethodAccessorImpl.java:39)
	at sun.reflect.DelegatingMethodAccessorImpl.invoke(DelegatingMethodAccessorImpl.java:25)
	at java.lang.reflect.Method.invoke(Method.java:592)
	at org.codehaus.plexus.classworlds.launcher.Launcher.launchStandard(Launcher.java:329)
	at org.codehaus.plexus.classworlds.launcher.Launcher.launch(Launcher.java:239)
	at org.jvnet.hudson.maven3.agent.Maven3Main.launch(Maven3Main.java:158)
	at hudson.maven.Maven3Builder.call(Maven3Builder.java:100)
	at hudson.maven.Maven3Builder.call(Maven3Builder.java:66)
	at hudson.remoting.UserRequest.perform(UserRequest.java:118)
	at hudson.remoting.UserRequest.perform(UserRequest.java:48)
	at hudson.remoting.Request$2.run(Request.java:326)
	at hudson.remoting.InterceptingExecutorService$1.call(InterceptingExecutorService.java:72)
	at java.util.concurrent.FutureTask$Sync.innerRun(FutureTask.java:269)
	at java.util.concurrent.FutureTask.run(FutureTask.java:123)
	at java.util.concurrent.ThreadPoolExecutor$Worker.runTask(ThreadPoolExecutor.java:651)
	at java.util.concurrent.ThreadPoolExecutor$Worker.run(ThreadPoolExecutor.java:676)
	at java.lang.Thread.run(Thread.java:595)
Caused by: org.apache.maven.plugin.MojoExecutionException: An error has occurred in Checkstyle
report generation.
	at org.apache.maven.reporting.AbstractMavenReport.execute(AbstractMavenReport.java:131)
	at org.apache.maven.plugin.DefaultBuildPluginManager.executeMojo(DefaultBuildPluginManager.java:101)
	at org.apache.maven.lifecycle.internal.MojoExecutor.execute(MojoExecutor.java:209)
	... 27 more
Caused by: org.apache.maven.reporting.MavenReportException: Failed during checkstyle execution
	at org.apache.maven.plugin.checkstyle.AbstractCheckstyleReport.executeReport(AbstractCheckstyleReport.java:278)
	at org.apache.maven.plugin.checkstyle.CheckstyleReport.executeReport(CheckstyleReport.java:348)
	at org.apache.maven.reporting.AbstractMavenReport.generate(AbstractMavenReport.java:196)
	at org.apache.maven.reporting.AbstractMavenReport.execute(AbstractMavenReport.java:104)
	... 29 more
Caused by: org.apache.maven.plugin.checkstyle.CheckstyleExecutorException: There are 3 checkstyle
errors.
	at org.apache.maven.plugin.checkstyle.DefaultCheckstyleExecutor.executeCheckstyle(DefaultCheckstyleExecutor.java:212)
	at org.apache.maven.plugin.checkstyle.AbstractCheckstyleReport.executeReport(AbstractCheckstyleReport.java:259)
	... 32 more
Sending e-mails to: commits@hc.apache.org
channel stopped

Mime
View raw message