hc-commits mailing list archives

Site index · List index
Message view « Date » · « Thread »
Top « Date » · « Thread »
From Apache Jenkins Server <jenk...@builds.apache.org>
Subject Build failed in Jenkins: HttpComponents Core #492
Date Wed, 05 Jun 2013 12:22:37 GMT
See <https://builds.apache.org/job/HttpComponents%20Core/492/changes>

Changes:

[olegk] HTTPCORE-341: Added methods to enumerate all available and leased connections in connection
pool (fixed java 1.5 compatibility)

[olegk] HTTPCORE-341: Added methods to enumerate all available and leased connections in connection
pool

------------------------------------------
[...truncated 457 lines...]
Audit done.

Jun 5, 2013 12:13:56 PM hudson.maven.ExecutedMojo <init>
WARNING: Failed to getClass for org.apache.maven.plugin.source.SourceJarMojo
[INFO] 
[INFO] --- maven-source-plugin:2.1.2:jar (attach-sources) @ httpcore-nio ---
[INFO] Building jar: <https://builds.apache.org/job/HttpComponents%20Core/ws/httpcore-trunk/httpcore-nio/target/httpcore-nio-4.3-beta3-SNAPSHOT-sources.jar>
[INFO] 
[INFO] --- maven-javadoc-plugin:2.8:jar (attach-javadocs) @ httpcore-nio ---
[WARNING] Source files encoding has not been set, using platform encoding ISO646-US, i.e.
build is platform dependent!
[INFO] Building jar: <https://builds.apache.org/job/HttpComponents%20Core/ws/httpcore-trunk/httpcore-nio/target/httpcore-nio-4.3-beta3-SNAPSHOT-javadoc.jar>
[INFO] 
[INFO] --- maven-site-plugin:3.0:attach-descriptor (attach-descriptor) @ httpcore-nio ---
[INFO] [INFO] Installing <https://builds.apache.org/job/HttpComponents%20Core/ws/httpcore-trunk/httpcore-nio/target/httpcore-nio-4.3-beta3-SNAPSHOT.jar>
to /export/home/hudson/hudson-slave/maven-repositories/0/org/apache/httpcomponents/httpcore-nio/4.3-beta3-SNAPSHOT/httpcore-nio-4.3-beta3-SNAPSHOT.jar

[INFO] --- maven-install-plugin:2.3.1:install (default-install) @ httpcore-nio ---[INFO] Installing
<https://builds.apache.org/job/HttpComponents%20Core/ws/httpcore-trunk/httpcore-nio/pom.xml>
to /export/home/hudson/hudson-slave/maven-repositories/0/org/apache/httpcomponents/httpcore-nio/4.3-beta3-SNAPSHOT/httpcore-nio-4.3-beta3-SNAPSHOT.pom

[INFO] Installing <https://builds.apache.org/job/HttpComponents%20Core/ws/httpcore-trunk/httpcore-nio/target/httpcore-nio-4.3-beta3-SNAPSHOT-sources.jar>
to /export/home/hudson/hudson-slave/maven-repositories/0/org/apache/httpcomponents/httpcore-nio/4.3-beta3-SNAPSHOT/httpcore-nio-4.3-beta3-SNAPSHOT-sources.jar
[INFO] Installing <https://builds.apache.org/job/HttpComponents%20Core/ws/httpcore-trunk/httpcore-nio/target/httpcore-nio-4.3-beta3-SNAPSHOT-javadoc.jar>
to /export/home/hudson/hudson-slave/maven-repositories/0/org/apache/httpcomponents/httpcore-nio/4.3-beta3-SNAPSHOT/httpcore-nio-4.3-beta3-SNAPSHOT-javadoc.jar
[INFO]                                                                         
[INFO] ------------------------------------------------------------------------
[INFO] Building HttpCore OSGi bundle 4.3-beta3-SNAPSHOT
[INFO] ------------------------------------------------------------------------
[INFO] 
[INFO] --- maven-clean-plugin:2.4.1:clean (default-clean) @ httpcore-osgi ---
[INFO] Deleting <https://builds.apache.org/job/HttpComponents%20Core/ws/httpcore-trunk/httpcore-osgi/target>
[INFO] 
[INFO] --- maven-checkstyle-plugin:2.9.1:checkstyle (validate) @ httpcore-osgi ---
[INFO] Starting audit...
Audit done.

[INFO] 
[INFO] --- maven-notice-plugin:0.0.2:generate (attach-notice-license) @ httpcore-osgi ---
[INFO] Generating NOTICE and LICENSE resources
[INFO] 
[INFO] --- buildnumber-maven-plugin:1.0:create (default) @ httpcore-osgi ---
[INFO] Checking for local modifications: skipped.
[INFO] Updating project files from SCM: skipped.
[INFO] Executing: /bin/sh -c cd "<https://builds.apache.org/job/HttpComponents%20Core/ws/httpcore-trunk/httpcore-osgi">
&& svn --non-interactive info
[INFO] Working directory: <https://builds.apache.org/job/HttpComponents%20Core/ws/httpcore-trunk/httpcore-osgi>
[INFO] Storing buildNumber: 1479886 at timestamp: 1370434488780
[INFO] Executing: /bin/sh -c cd "<https://builds.apache.org/job/HttpComponents%20Core/ws/httpcore-trunk/httpcore-osgi">
&& svn --non-interactive info
[INFO] Working directory: <https://builds.apache.org/job/HttpComponents%20Core/ws/httpcore-trunk/httpcore-osgi>
[INFO] Storing buildScmBranch: trunk
[INFO] 
[INFO] --- maven-resources-plugin:2.5:resources (default-resources) @ httpcore-osgi ---
[debug] execute contextualize
[WARNING] Using platform encoding (ISO646-US actually) to copy filtered resources, i.e. build
is platform dependent!
[INFO] skip non existing resourceDirectory <https://builds.apache.org/job/HttpComponents%20Core/ws/httpcore-trunk/httpcore-osgi/src/main/resources>
[INFO] Copying 2 resources to META-INF
[INFO] 
[INFO] --- maven-compiler-plugin:2.3.2:compile (default-compile) @ httpcore-osgi ---
[INFO] No sources to compile
[INFO] 
[INFO] --- maven-resources-plugin:2.5:testResources (default-testResources) @ httpcore-osgi
---[debug] execute contextualize
[WARNING] Using platform encoding (ISO646-US actually) to copy filtered resources, i.e. build
is platform dependent!
[INFO] skip non existing resourceDirectory <https://builds.apache.org/job/HttpComponents%20Core/ws/httpcore-trunk/httpcore-osgi/src/test/resources>
[INFO] Copying 2 resources to META-INF

[INFO] 
[INFO] --- maven-compiler-plugin:2.3.2:testCompile (default-testCompile) @ httpcore-osgi ---[INFO]
No sources to compile

[INFO] 
[INFO] --- maven-surefire-plugin:2.9:test (default-test) @ httpcore-osgi ---
[INFO] Surefire report directory: <https://builds.apache.org/job/HttpComponents%20Core/ws/httpcore-trunk/httpcore-osgi/target/surefire-reports>

-------------------------------------------------------
 T E S T S
-------------------------------------------------------

Results :

Tests run: 0, Failures: 0, Errors: 0, Skipped: 0

[JENKINS] Recording test results
[INFO] 
[INFO] --- maven-bundle-plugin:2.3.7:bundle (default-bundle) @ httpcore-osgi ---
[INFO] 
[INFO] --- maven-checkstyle-plugin:2.9.1:checkstyle (validate) @ httpcore-osgi ---
[INFO] Starting audit...
Audit done.

Jun 5, 2013 12:15:21 PM hudson.maven.ExecutedMojo <init>
WARNING: Failed to getClass for org.apache.maven.plugin.source.SourceJarMojo
[INFO] 
[INFO] --- maven-source-plugin:2.1.2:jar (attach-sources) @ httpcore-osgi ---
[INFO] Building jar: <https://builds.apache.org/job/HttpComponents%20Core/ws/httpcore-trunk/httpcore-osgi/target/org.apache.httpcomponents.httpcore_4.3-beta3-SNAPSHOT-sources.jar>
[INFO] 
[INFO] --- maven-javadoc-plugin:2.8:jar (attach-javadocs) @ httpcore-osgi ---
[INFO] 
[INFO] --- maven-site-plugin:3.0:attach-descriptor (attach-descriptor) @ httpcore-osgi ---
[INFO] 
[INFO] --- maven-install-plugin:2.3.1:install (default-install) @ httpcore-osgi ---[INFO]
Installing <https://builds.apache.org/job/HttpComponents%20Core/ws/httpcore-trunk/httpcore-osgi/target/org.apache.httpcomponents.httpcore_4.3-beta3-SNAPSHOT.jar>
to /export/home/hudson/hudson-slave/maven-repositories/0/org/apache/httpcomponents/httpcore-osgi/4.3-beta3-SNAPSHOT/httpcore-osgi-4.3-beta3-SNAPSHOT.jar

[INFO] Installing <https://builds.apache.org/job/HttpComponents%20Core/ws/httpcore-trunk/httpcore-osgi/pom.xml>
to /export/home/hudson/hudson-slave/maven-repositories/0/org/apache/httpcomponents/httpcore-osgi/4.3-beta3-SNAPSHOT/httpcore-osgi-4.3-beta3-SNAPSHOT.pom
[INFO] Installing <https://builds.apache.org/job/HttpComponents%20Core/ws/httpcore-trunk/httpcore-osgi/target/org.apache.httpcomponents.httpcore_4.3-beta3-SNAPSHOT-sources.jar>
to /export/home/hudson/hudson-slave/maven-repositories/0/org/apache/httpcomponents/httpcore-osgi/4.3-beta3-SNAPSHOT/httpcore-osgi-4.3-beta3-SNAPSHOT-sources.jar
[INFO] 
[INFO] --- maven-bundle-plugin:2.3.7:install (default-install) @ httpcore-osgi ---
[INFO] Installing org/apache/httpcomponents/httpcore-osgi/4.3-beta3-SNAPSHOT/httpcore-osgi-4.3-beta3-SNAPSHOT.jar
[INFO] Writing OBR metadata
[INFO]                                                                         
[INFO] ------------------------------------------------------------------------
[INFO] Building HttpCore AB clone 4.3-beta3-SNAPSHOT
[INFO] ------------------------------------------------------------------------
[INFO] 
[INFO] --- maven-clean-plugin:2.4.1:clean (default-clean) @ httpcore-ab ---[INFO] Deleting
<https://builds.apache.org/job/HttpComponents%20Core/ws/httpcore-trunk/httpcore-ab/target>

[INFO] 
[INFO] --- maven-checkstyle-plugin:2.9.1:checkstyle (validate) @ httpcore-ab ---
[INFO] Starting audit...
Audit done.

[INFO] 
[INFO] --- maven-notice-plugin:0.0.2:generate (attach-notice-license) @ httpcore-ab ---[INFO]
Generating NOTICE and LICENSE resources

[INFO] 
[INFO] [INFO] Checking for local modifications: skipped.
[INFO] Updating project files from SCM: skipped.
[INFO] Executing: /bin/sh -c cd "<https://builds.apache.org/job/HttpComponents%20Core/ws/httpcore-trunk/httpcore-ab">
&& svn --non-interactive info
[INFO] Working directory: <https://builds.apache.org/job/HttpComponents%20Core/ws/httpcore-trunk/httpcore-ab>
--- buildnumber-maven-plugin:1.0:create (default) @ httpcore-ab ---
[INFO] Storing buildNumber: 1487830 at timestamp: 1370434556214
[INFO] Executing: /bin/sh -c cd "<https://builds.apache.org/job/HttpComponents%20Core/ws/httpcore-trunk/httpcore-ab">
&& svn --non-interactive info
[INFO] Working directory: <https://builds.apache.org/job/HttpComponents%20Core/ws/httpcore-trunk/httpcore-ab>
[INFO] Storing buildScmBranch: trunk
[INFO] 
[INFO] --- maven-resources-plugin:2.5:resources (default-resources) @ httpcore-ab ---[debug]
execute contextualize
[WARNING] Using platform encoding (ISO646-US actually) to copy filtered resources, i.e. build
is platform dependent!
[INFO] skip non existing resourceDirectory <https://builds.apache.org/job/HttpComponents%20Core/ws/httpcore-trunk/httpcore-ab/src/main/resources>
[INFO] Copying 2 resources to META-INF

[INFO] 
[INFO] --- maven-compiler-plugin:2.3.2:compile (default-compile) @ httpcore-ab ---[WARNING]
File encoding has not been set, using platform encoding ISO646-US, i.e. build is platform
dependent!
[INFO] Compiling 11 source files to <https://builds.apache.org/job/HttpComponents%20Core/ws/httpcore-trunk/httpcore-ab/target/classes>

[INFO] 
[debug] execute contextualize
[INFO] --- maven-resources-plugin:2.5:testResources (default-testResources) @ httpcore-ab
---[WARNING] Using platform encoding (ISO646-US actually) to copy filtered resources, i.e.
build is platform dependent!
[INFO] skip non existing resourceDirectory <https://builds.apache.org/job/HttpComponents%20Core/ws/httpcore-trunk/httpcore-ab/src/test/resources>
[INFO] Copying 2 resources to META-INF

[INFO] 
[INFO] --- maven-compiler-plugin:2.3.2:testCompile (default-testCompile) @ httpcore-ab ---[WARNING]
File encoding has not been set, using platform encoding ISO646-US, i.e. build is platform
dependent!
[INFO] Compiling 2 source files to <https://builds.apache.org/job/HttpComponents%20Core/ws/httpcore-trunk/httpcore-ab/target/test-classes>

[INFO] 
[INFO] --- maven-surefire-plugin:2.9:test (default-test) @ httpcore-ab ---[INFO] Surefire
report directory: <https://builds.apache.org/job/HttpComponents%20Core/ws/httpcore-trunk/httpcore-ab/target/surefire-reports>


-------------------------------------------------------
 T E S T S
-------------------------------------------------------

Results :

Tests run: 0, Failures: 0, Errors: 0, Skipped: 0

[JENKINS] Recording test results
[INFO] ------------------------------------------------------------------------
[INFO] Reactor Summary:
[INFO] 
[INFO] HttpComponents Core ............................... SUCCESS [3:27.808s]
[INFO] HttpCore .......................................... SUCCESS [3:13.304s]
[INFO] HttpCore NIO ...................................... SUCCESS [4:07.648s]
[INFO] HttpCore OSGi bundle .............................. SUCCESS [1:10.513s]
[INFO] HttpCore AB clone ................................. FAILURE [26.572s]
[INFO] ------------------------------------------------------------------------
[INFO] BUILD FAILURE
[INFO] ------------------------------------------------------------------------
[INFO] Total time: 12:56.602s
[INFO] Finished at: Wed Jun 05 12:16:18 GMT+00:00 2013
[INFO] Final Memory: 36M/198M
[INFO] ------------------------------------------------------------------------
[JENKINS] Archiving <https://builds.apache.org/job/HttpComponents%20Core/ws/httpcore-trunk/httpcore-nio/pom.xml>
to /home/hudson/hudson/jobs/HttpComponents Core/modules/org.apache.httpcomponents$httpcore-nio/builds/2013-06-05_12-01-24/archive/org.apache.httpcomponents/httpcore-nio/4.3-beta3-SNAPSHOT/httpcore-nio-4.3-beta3-SNAPSHOT.pom
[JENKINS] Archiving <https://builds.apache.org/job/HttpComponents%20Core/ws/httpcore-trunk/httpcore-nio/target/httpcore-nio-4.3-beta3-SNAPSHOT.jar>
to /home/hudson/hudson/jobs/HttpComponents Core/modules/org.apache.httpcomponents$httpcore-nio/builds/2013-06-05_12-01-24/archive/org.apache.httpcomponents/httpcore-nio/4.3-beta3-SNAPSHOT/httpcore-nio-4.3-beta3-SNAPSHOT.jar
[JENKINS] Archiving <https://builds.apache.org/job/HttpComponents%20Core/ws/httpcore-trunk/httpcore-nio/target/httpcore-nio-4.3-beta3-SNAPSHOT-sources.jar>
to /home/hudson/hudson/jobs/HttpComponents Core/modules/org.apache.httpcomponents$httpcore-nio/builds/2013-06-05_12-01-24/archive/org.apache.httpcomponents/httpcore-nio/4.3-beta3-SNAPSHOT/httpcore-nio-4.3-beta3-SNAPSHOT-sources.jar
[JENKINS] Archiving <https://builds.apache.org/job/HttpComponents%20Core/ws/httpcore-trunk/httpcore-nio/target/httpcore-nio-4.3-beta3-SNAPSHOT-javadoc.jar>
to /home/hudson/hudson/jobs/HttpComponents Core/modules/org.apache.httpcomponents$httpcore-nio/builds/2013-06-05_12-01-24/archive/org.apache.httpcomponents/httpcore-nio/4.3-beta3-SNAPSHOT/httpcore-nio-4.3-beta3-SNAPSHOT-javadoc.jar
[JENKINS] Archiving <https://builds.apache.org/job/HttpComponents%20Core/ws/httpcore-trunk/httpcore/pom.xml>
to /home/hudson/hudson/jobs/HttpComponents Core/modules/org.apache.httpcomponents$httpcore/builds/2013-06-05_12-01-23/archive/org.apache.httpcomponents/httpcore/4.3-beta3-SNAPSHOT/httpcore-4.3-beta3-SNAPSHOT.pom
[JENKINS] Archiving <https://builds.apache.org/job/HttpComponents%20Core/ws/httpcore-trunk/httpcore/target/httpcore-4.3-beta3-SNAPSHOT.jar>
to /home/hudson/hudson/jobs/HttpComponents Core/modules/org.apache.httpcomponents$httpcore/builds/2013-06-05_12-01-23/archive/org.apache.httpcomponents/httpcore/4.3-beta3-SNAPSHOT/httpcore-4.3-beta3-SNAPSHOT.jar
[JENKINS] Archiving <https://builds.apache.org/job/HttpComponents%20Core/ws/httpcore-trunk/httpcore/target/httpcore-4.3-beta3-SNAPSHOT-sources.jar>
to /home/hudson/hudson/jobs/HttpComponents Core/modules/org.apache.httpcomponents$httpcore/builds/2013-06-05_12-01-23/archive/org.apache.httpcomponents/httpcore/4.3-beta3-SNAPSHOT/httpcore-4.3-beta3-SNAPSHOT-sources.jar
[JENKINS] Archiving <https://builds.apache.org/job/HttpComponents%20Core/ws/httpcore-trunk/httpcore/target/httpcore-4.3-beta3-SNAPSHOT-javadoc.jar>
to /home/hudson/hudson/jobs/HttpComponents Core/modules/org.apache.httpcomponents$httpcore/builds/2013-06-05_12-01-23/archive/org.apache.httpcomponents/httpcore/4.3-beta3-SNAPSHOT/httpcore-4.3-beta3-SNAPSHOT-javadoc.jar
[JENKINS] Archiving <https://builds.apache.org/job/HttpComponents%20Core/ws/httpcore-trunk/httpcore-osgi/pom.xml>
to /home/hudson/hudson/jobs/HttpComponents Core/modules/org.apache.httpcomponents$httpcore-osgi/builds/2013-06-05_12-01-25/archive/org.apache.httpcomponents/httpcore-osgi/4.3-beta3-SNAPSHOT/httpcore-osgi-4.3-beta3-SNAPSHOT.pom
[JENKINS] Archiving <https://builds.apache.org/job/HttpComponents%20Core/ws/httpcore-trunk/httpcore-osgi/target/org.apache.httpcomponents.httpcore_4.3-beta3-SNAPSHOT.jar>
to /home/hudson/hudson/jobs/HttpComponents Core/modules/org.apache.httpcomponents$httpcore-osgi/builds/2013-06-05_12-01-25/archive/org.apache.httpcomponents/httpcore-osgi/4.3-beta3-SNAPSHOT/httpcore-osgi-4.3-beta3-SNAPSHOT.jar
[JENKINS] Archiving <https://builds.apache.org/job/HttpComponents%20Core/ws/httpcore-trunk/httpcore-osgi/target/org.apache.httpcomponents.httpcore_4.3-beta3-SNAPSHOT-sources.jar>
to /home/hudson/hudson/jobs/HttpComponents Core/modules/org.apache.httpcomponents$httpcore-osgi/builds/2013-06-05_12-01-25/archive/org.apache.httpcomponents/httpcore-osgi/4.3-beta3-SNAPSHOT/httpcore-osgi-4.3-beta3-SNAPSHOT-sources.jar
[JENKINS] Archiving <https://builds.apache.org/job/HttpComponents%20Core/ws/httpcore-trunk/httpcore-ab/pom.xml>
to /home/hudson/hudson/jobs/HttpComponents Core/modules/org.apache.httpcomponents$httpcore-ab/builds/2013-06-05_12-01-26/archive/org.apache.httpcomponents/httpcore-ab/4.3-beta3-SNAPSHOT/httpcore-ab-4.3-beta3-SNAPSHOT.pom
[JENKINS] Archiving <https://builds.apache.org/job/HttpComponents%20Core/ws/httpcore-trunk/pom.xml>
to /home/hudson/hudson/jobs/HttpComponents Core/modules/org.apache.httpcomponents$httpcomponents-core/builds/2013-06-05_12-01-21/archive/org.apache.httpcomponents/httpcomponents-core/4.3-beta3-SNAPSHOT/httpcomponents-core-4.3-beta3-SNAPSHOT.pom
[JENKINS] Archiving <https://builds.apache.org/job/HttpComponents%20Core/ws/httpcore-trunk/target/httpcomponents-core-4.3-beta3-SNAPSHOT-site.xml>
to /home/hudson/hudson/jobs/HttpComponents Core/modules/org.apache.httpcomponents$httpcomponents-core/builds/2013-06-05_12-01-21/archive/org.apache.httpcomponents/httpcomponents-core/4.3-beta3-SNAPSHOT/httpcomponents-core-4.3-beta3-SNAPSHOT-site.xml
Waiting for Jenkins to finish collecting data
mavenExecutionResult exceptions not empty
message : Failed to execute goal org.apache.maven.plugins:maven-surefire-plugin:2.9:test (default-test)
on project httpcore-ab: Error while executing forked tests.; nested exception is java.io.IOException:
Not enough space
cause : Error while executing forked tests.; nested exception is java.io.IOException: Not
enough space
Stack trace : 
org.apache.maven.lifecycle.LifecycleExecutionException: Failed to execute goal org.apache.maven.plugins:maven-surefire-plugin:2.9:test
(default-test) on project httpcore-ab: Error while executing forked tests.; nested exception
is java.io.IOException: Not enough space
	at org.apache.maven.lifecycle.internal.MojoExecutor.execute(MojoExecutor.java:217)
	at org.apache.maven.lifecycle.internal.MojoExecutor.execute(MojoExecutor.java:153)
	at org.apache.maven.lifecycle.internal.MojoExecutor.execute(MojoExecutor.java:145)
	at org.apache.maven.lifecycle.internal.LifecycleModuleBuilder.buildProject(LifecycleModuleBuilder.java:84)
	at org.apache.maven.lifecycle.internal.LifecycleModuleBuilder.buildProject(LifecycleModuleBuilder.java:59)
	at org.apache.maven.lifecycle.internal.LifecycleStarter.singleThreadedBuild(LifecycleStarter.java:183)
	at org.apache.maven.lifecycle.internal.LifecycleStarter.execute(LifecycleStarter.java:161)
	at org.apache.maven.DefaultMaven.doExecute(DefaultMaven.java:319)
	at org.apache.maven.DefaultMaven.execute(DefaultMaven.java:156)
	at org.jvnet.hudson.maven3.launcher.Maven3Launcher.main(Maven3Launcher.java:79)
	at sun.reflect.NativeMethodAccessorImpl.invoke0(Native Method)
	at sun.reflect.NativeMethodAccessorImpl.invoke(NativeMethodAccessorImpl.java:39)
	at sun.reflect.DelegatingMethodAccessorImpl.invoke(DelegatingMethodAccessorImpl.java:25)
	at java.lang.reflect.Method.invoke(Method.java:592)
	at org.codehaus.plexus.classworlds.launcher.Launcher.launchStandard(Launcher.java:329)
	at org.codehaus.plexus.classworlds.launcher.Launcher.launch(Launcher.java:239)
	at org.jvnet.hudson.maven3.agent.Maven3Main.launch(Maven3Main.java:158)
	at hudson.maven.Maven3Builder.call(Maven3Builder.java:100)
	at hudson.maven.Maven3Builder.call(Maven3Builder.java:66)
	at hudson.remoting.UserRequest.perform(UserRequest.java:118)
	at hudson.remoting.UserRequest.perform(UserRequest.java:48)
	at hudson.remoting.Request$2.run(Request.java:326)
	at hudson.remoting.InterceptingExecutorService$1.call(InterceptingExecutorService.java:72)
	at java.util.concurrent.FutureTask$Sync.innerRun(FutureTask.java:269)
	at java.util.concurrent.FutureTask.run(FutureTask.java:123)
	at java.util.concurrent.ThreadPoolExecutor$Worker.runTask(ThreadPoolExecutor.java:651)
	at java.util.concurrent.ThreadPoolExecutor$Worker.run(ThreadPoolExecutor.java:676)
	at java.lang.Thread.run(Thread.java:595)
Caused by: org.apache.maven.plugin.MojoExecutionException: Error while executing forked tests.;
nested exception is java.io.IOException: Not enough space
	at org.apache.maven.plugin.surefire.SurefirePlugin.assertNoException(SurefirePlugin.java:614)
	at org.apache.maven.plugin.surefire.SurefirePlugin.handleSummary(SurefirePlugin.java:603)
	at org.apache.maven.plugin.surefire.AbstractSurefireMojo.executeAfterPreconditionsChecked(AbstractSurefireMojo.java:136)
	at org.apache.maven.plugin.surefire.AbstractSurefireMojo.execute(AbstractSurefireMojo.java:97)
	at org.apache.maven.plugin.DefaultBuildPluginManager.executeMojo(DefaultBuildPluginManager.java:101)
	at org.apache.maven.lifecycle.internal.MojoExecutor.execute(MojoExecutor.java:209)
	... 27 more
Caused by: org.apache.maven.surefire.booter.SurefireBooterForkException: Error while executing
forked tests.; nested exception is java.io.IOException: Not enough space
	at org.apache.maven.plugin.surefire.booterclient.ForkStarter.fork(ForkStarter.java:206)
	at org.apache.maven.plugin.surefire.booterclient.ForkStarter.run(ForkStarter.java:98)
	at org.apache.maven.plugin.surefire.AbstractSurefireMojo.executeProvider(AbstractSurefireMojo.java:199)
	at org.apache.maven.plugin.surefire.AbstractSurefireMojo.executeAllProviders(AbstractSurefireMojo.java:176)
	at org.apache.maven.plugin.surefire.AbstractSurefireMojo.executeAfterPreconditionsChecked(AbstractSurefireMojo.java:134)
	... 30 more
Caused by: java.io.IOException: Not enough space
	at java.lang.UNIXProcess.forkAndExec(Native Method)
	at java.lang.UNIXProcess.<init>(UNIXProcess.java:53)
	at java.lang.ProcessImpl.start(ProcessImpl.java:65)
	at java.lang.ProcessBuilder.start(ProcessBuilder.java:451)
	at java.lang.Runtime.exec(Runtime.java:591)
	at org.codehaus.plexus.util.cli.Commandline.execute(Commandline.java:651)
	at org.codehaus.plexus.util.cli.CommandLineUtils.executeCommandLine(CommandLineUtils.java:119)
	at org.codehaus.plexus.util.cli.CommandLineUtils.executeCommandLine(CommandLineUtils.java:88)
	at org.apache.maven.plugin.surefire.booterclient.ForkStarter.fork(ForkStarter.java:191)
	... 34 more
Sending e-mails to: commits@hc.apache.org
channel stopped

Mime
View raw message