hc-commits mailing list archives

Site index · List index
Message view « Date » · « Thread »
Top « Date » · « Thread »
From Apache Jenkins Server <jenk...@builds.apache.org>
Subject Build failed in Jenkins: HttpComponents Client #563
Date Sat, 09 Mar 2013 12:05:00 GMT
See <https://builds.apache.org/job/HttpComponents%20Client/563/changes>

Changes:

[olegk] HTTPCLIENT-1320: Leverage javax.net.ssl.SSLSocketFactory#getDefault() to initialize
SSL context based on system defaults instead of using an internal custom routine

[olegk] Minor tweak to debug log message

[olegk] Revised HttpClientConnectionManager API

------------------------------------------
[...truncated 1473 lines...]
Running org.apache.http.impl.client.cache.TestExponentialBackingOffSchedulingStrategy
Tests run: 8, Failures: 0, Errors: 0, Skipped: 0, Time elapsed: 0.015 sec
Running org.apache.http.impl.client.cache.TestAsynchronousValidator
Tests run: 7, Failures: 0, Errors: 0, Skipped: 0, Time elapsed: 0.006 sec
Running org.apache.http.impl.client.cache.TestCacheInvalidator
Tests run: 26, Failures: 0, Errors: 0, Skipped: 0, Time elapsed: 0.005 sec
Running org.apache.http.impl.client.cache.TestBasicHttpCache
Tests run: 20, Failures: 0, Errors: 0, Skipped: 0, Time elapsed: 0.02 sec

Results :

Tests run: 980, Failures: 0, Errors: 0, Skipped: 2

[JENKINS] Recording test results
[INFO] 
[INFO] --- maven-jar-plugin:2.3.2:jar (default-jar) @ httpclient-cache ---
[INFO] Building jar: <https://builds.apache.org/job/HttpComponents%20Client/ws/httpclient-trunk/httpclient-cache/target/httpclient-cache-4.3-alpha2-SNAPSHOT.jar>
[INFO] 
[INFO] --- maven-checkstyle-plugin:2.9.1:checkstyle (validate) @ httpclient-cache ---
[INFO] Starting audit...
Audit done.

Mar 9, 2013 12:04:27 PM hudson.maven.ExecutedMojo <init>
WARNING: Failed to getClass for org.apache.maven.plugin.source.SourceJarMojo
[INFO] 
[INFO] --- maven-source-plugin:2.1.2:jar (attach-sources) @ httpclient-cache ---
[INFO] Building jar: <https://builds.apache.org/job/HttpComponents%20Client/ws/httpclient-trunk/httpclient-cache/target/httpclient-cache-4.3-alpha2-SNAPSHOT-sources.jar>
[INFO] 
[INFO] --- maven-site-plugin:3.0:attach-descriptor (attach-descriptor) @ httpclient-cache
---
[INFO] [INFO] Installing <https://builds.apache.org/job/HttpComponents%20Client/ws/httpclient-trunk/httpclient-cache/target/httpclient-cache-4.3-alpha2-SNAPSHOT.jar>
to /home/jenkins/jenkins-slave/maven-repositories/0/org/apache/httpcomponents/httpclient-cache/4.3-alpha2-SNAPSHOT/httpclient-cache-4.3-alpha2-SNAPSHOT.jar

[INFO] --- maven-install-plugin:2.3.1:install (default-install) @ httpclient-cache ---
[INFO] Installing <https://builds.apache.org/job/HttpComponents%20Client/ws/httpclient-trunk/httpclient-cache/pom.xml>
to /home/jenkins/jenkins-slave/maven-repositories/0/org/apache/httpcomponents/httpclient-cache/4.3-alpha2-SNAPSHOT/httpclient-cache-4.3-alpha2-SNAPSHOT.pom
[INFO] Installing <https://builds.apache.org/job/HttpComponents%20Client/ws/httpclient-trunk/httpclient-cache/target/httpclient-cache-4.3-alpha2-SNAPSHOT-sources.jar>
to /home/jenkins/jenkins-slave/maven-repositories/0/org/apache/httpcomponents/httpclient-cache/4.3-alpha2-SNAPSHOT/httpclient-cache-4.3-alpha2-SNAPSHOT-sources.jar
[INFO]                                                                         
[INFO] ------------------------------------------------------------------------
[INFO] Building Fluent HttpClient 4.3-alpha2-SNAPSHOT
[INFO] ------------------------------------------------------------------------
[INFO] 
[INFO] --- maven-clean-plugin:2.4.1:clean (default-clean) @ fluent-hc ---
[INFO] 
[INFO] --- maven-checkstyle-plugin:2.9.1:checkstyle (validate) @ fluent-hc ---
[INFO] Starting audit...
Audit done.

[INFO] [INFO] Generating NOTICE and LICENSE resources

[INFO] --- maven-notice-plugin:0.0.2:generate (attach-notice-license) @ fluent-hc ---
[INFO] [INFO] Checking for local modifications: skipped.
[INFO] Updating project files from SCM: skipped.
[INFO] Executing: /bin/sh -c cd "<https://builds.apache.org/job/HttpComponents%20Client/ws/httpclient-trunk/fluent-hc">
&& svn --non-interactive info
[INFO] Working directory: <https://builds.apache.org/job/HttpComponents%20Client/ws/httpclient-trunk/fluent-hc>
[INFO] Storing buildNumber: 1439913 at timestamp: 1362830669935
[INFO] Executing: /bin/sh -c cd "<https://builds.apache.org/job/HttpComponents%20Client/ws/httpclient-trunk/fluent-hc">
&& svn --non-interactive info
[INFO] Working directory: <https://builds.apache.org/job/HttpComponents%20Client/ws/httpclient-trunk/fluent-hc>

[INFO] --- buildnumber-maven-plugin:1.0:create (default) @ fluent-hc ---
[INFO] Storing buildScmBranch: trunk
[INFO] [debug] execute contextualize
[WARNING] File encoding has not been set, using platform encoding ANSI_X3.4-1968, i.e. build
is platform dependent!
[WARNING] Using platform encoding (ANSI_X3.4-1968 actually) to copy filtered resources, i.e.
build is platform dependent!
[INFO] skip non existing resourceDirectory <https://builds.apache.org/job/HttpComponents%20Client/ws/httpclient-trunk/fluent-hc/src/main/resources>
[INFO] Copying 2 resources to META-INF

[INFO] --- maven-resources-plugin:2.5:resources (default-resources) @ fluent-hc ---
[INFO] [WARNING] File encoding has not been set, using platform encoding ANSI_X3.4-1968, i.e.
build is platform dependent!
[INFO] Compiling 8 source files to <https://builds.apache.org/job/HttpComponents%20Client/ws/httpclient-trunk/fluent-hc/target/classes>

[INFO] --- maven-compiler-plugin:2.3.2:compile (default-compile) @ fluent-hc ---
[INFO] [debug] execute contextualize
[WARNING] Using platform encoding (ANSI_X3.4-1968 actually) to copy filtered resources, i.e.
build is platform dependent!
[INFO] skip non existing resourceDirectory <https://builds.apache.org/job/HttpComponents%20Client/ws/httpclient-trunk/fluent-hc/src/test/resources>
[INFO] Copying 2 resources to META-INF

[INFO] --- maven-resources-plugin:2.5:testResources (default-testResources) @ fluent-hc ---
[INFO] [INFO] Nothing to compile - all classes are up to date

[INFO] --- maven-compiler-plugin:2.3.2:testCompile (default-testCompile) @ fluent-hc ---
[INFO] [INFO] Surefire report directory: <https://builds.apache.org/job/HttpComponents%20Client/ws/httpclient-trunk/fluent-hc/target/surefire-reports>

-------------------------------------------------------
 T E S T S
-------------------------------------------------------

[INFO] --- maven-surefire-plugin:2.9:test (default-test) @ fluent-hc ---

Results :

Tests run: 0, Failures: 0, Errors: 0, Skipped: 0

[JENKINS] Recording test results
[INFO] 
[INFO] --- maven-jar-plugin:2.3.2:jar (default-jar) @ fluent-hc ---
[INFO] Building jar: <https://builds.apache.org/job/HttpComponents%20Client/ws/httpclient-trunk/fluent-hc/target/fluent-hc-4.3-alpha2-SNAPSHOT.jar>
[INFO] 
[INFO] --- maven-checkstyle-plugin:2.9.1:checkstyle (validate) @ fluent-hc ---
[INFO] Starting audit...
Audit done.

Mar 9, 2013 12:04:32 PM hudson.maven.ExecutedMojo <init>
WARNING: Failed to getClass for org.apache.maven.plugin.source.SourceJarMojo
[INFO] 
[INFO] --- maven-source-plugin:2.1.2:jar (attach-sources) @ fluent-hc ---
[INFO] Building jar: <https://builds.apache.org/job/HttpComponents%20Client/ws/httpclient-trunk/fluent-hc/target/fluent-hc-4.3-alpha2-SNAPSHOT-sources.jar>
[INFO] 
[INFO] --- maven-site-plugin:3.0:attach-descriptor (attach-descriptor) @ fluent-hc ---
[INFO] [INFO] Installing <https://builds.apache.org/job/HttpComponents%20Client/ws/httpclient-trunk/fluent-hc/target/fluent-hc-4.3-alpha2-SNAPSHOT.jar>
to /home/jenkins/jenkins-slave/maven-repositories/0/org/apache/httpcomponents/fluent-hc/4.3-alpha2-SNAPSHOT/fluent-hc-4.3-alpha2-SNAPSHOT.jar

[INFO] --- maven-install-plugin:2.3.1:install (default-install) @ fluent-hc ---
[INFO] Installing <https://builds.apache.org/job/HttpComponents%20Client/ws/httpclient-trunk/fluent-hc/pom.xml>
to /home/jenkins/jenkins-slave/maven-repositories/0/org/apache/httpcomponents/fluent-hc/4.3-alpha2-SNAPSHOT/fluent-hc-4.3-alpha2-SNAPSHOT.pom
[INFO] Installing <https://builds.apache.org/job/HttpComponents%20Client/ws/httpclient-trunk/fluent-hc/target/fluent-hc-4.3-alpha2-SNAPSHOT-sources.jar>
to /home/jenkins/jenkins-slave/maven-repositories/0/org/apache/httpcomponents/fluent-hc/4.3-alpha2-SNAPSHOT/fluent-hc-4.3-alpha2-SNAPSHOT-sources.jar
[INFO]                                                                         
[INFO] ------------------------------------------------------------------------
[INFO] Building HttpClient OSGi bundle 4.3-alpha2-SNAPSHOT
[INFO] ------------------------------------------------------------------------
[INFO] 
[INFO] --- maven-clean-plugin:2.4.1:clean (default-clean) @ httpclient-osgi ---
[INFO] 
[INFO] --- maven-checkstyle-plugin:2.9.1:checkstyle (validate) @ httpclient-osgi ---
[INFO] Starting audit...
Audit done.

[INFO] [INFO] Generating NOTICE and LICENSE resources

[INFO] --- maven-notice-plugin:0.0.2:generate (attach-notice-license) @ httpclient-osgi ---
[INFO] 
[INFO] --- buildnumber-maven-plugin:1.0:create (default) @ httpclient-osgi ---
[INFO] Checking for local modifications: skipped.
[INFO] Updating project files from SCM: skipped.
[INFO] Executing: /bin/sh -c cd "<https://builds.apache.org/job/HttpComponents%20Client/ws/httpclient-trunk/httpclient-osgi">
&& svn --non-interactive info
[INFO] Working directory: <https://builds.apache.org/job/HttpComponents%20Client/ws/httpclient-trunk/httpclient-osgi>
[INFO] Storing buildNumber: 1435976 at timestamp: 1362830675793
[INFO] Executing: /bin/sh -c cd "<https://builds.apache.org/job/HttpComponents%20Client/ws/httpclient-trunk/httpclient-osgi">
&& svn --non-interactive info
[INFO] Working directory: <https://builds.apache.org/job/HttpComponents%20Client/ws/httpclient-trunk/httpclient-osgi>
[INFO] Storing buildScmBranch: trunk
[INFO] [debug] execute contextualize

[INFO] --- maven-resources-plugin:2.5:resources (default-resources) @ httpclient-osgi ---
[WARNING] File encoding has not been set, using platform encoding ANSI_X3.4-1968, i.e. build
is platform dependent!
[WARNING] Using platform encoding (ANSI_X3.4-1968 actually) to copy filtered resources, i.e.
build is platform dependent!
[INFO] skip non existing resourceDirectory <https://builds.apache.org/job/HttpComponents%20Client/ws/httpclient-trunk/httpclient-osgi/src/main/resources>
[INFO] Copying 2 resources to META-INF
[INFO] [INFO] No sources to compile

[INFO] --- maven-compiler-plugin:2.3.2:compile (default-compile) @ httpclient-osgi ---
[INFO] [debug] execute contextualize
[WARNING] Using platform encoding (ANSI_X3.4-1968 actually) to copy filtered resources, i.e.
build is platform dependent!
[INFO] skip non existing resourceDirectory <https://builds.apache.org/job/HttpComponents%20Client/ws/httpclient-trunk/httpclient-osgi/src/test/resources>
[INFO] Copying 2 resources to META-INF

[INFO] --- maven-resources-plugin:2.5:testResources (default-testResources) @ httpclient-osgi
---
[INFO] [INFO] No sources to compile

[INFO] --- maven-compiler-plugin:2.3.2:testCompile (default-testCompile) @ httpclient-osgi
---
[INFO] [INFO] Surefire report directory: <https://builds.apache.org/job/HttpComponents%20Client/ws/httpclient-trunk/httpclient-osgi/target/surefire-reports>

[INFO] --- maven-surefire-plugin:2.9:test (default-test) @ httpclient-osgi ---

-------------------------------------------------------
 T E S T S
-------------------------------------------------------

Results :

Tests run: 0, Failures: 0, Errors: 0, Skipped: 0

[JENKINS] Recording test results
[INFO] 
[INFO] --- maven-bundle-plugin:2.3.7:bundle (default-bundle) @ httpclient-osgi ---
[ERROR] Bundle org.apache.httpcomponents:httpclient-osgi:bundle:4.3-alpha2-SNAPSHOT : Unresolved
references to [javax.net] by class(es) on the Bundle-Classpath[Jar:dot]: [org/apache/http/conn/ssl/SSLSocketFactory.class]
[ERROR] Error(s) found in bundle configuration
[INFO] ------------------------------------------------------------------------
[INFO] Reactor Summary:
[INFO] 
[INFO] HttpComponents Client ............................. SUCCESS [29.365s]
[INFO] HttpClient ........................................ SUCCESS [59.284s]
[INFO] HttpMime .......................................... SUCCESS [4.655s]
[INFO] HttpClient Cache .................................. SUCCESS [18.538s]
[INFO] Fluent HttpClient ................................. SUCCESS [4.553s]
[INFO] HttpClient OSGi bundle ............................ FAILURE [4.809s]
[INFO] ------------------------------------------------------------------------
[INFO] BUILD FAILURE
[INFO] ------------------------------------------------------------------------
[INFO] Total time: 2:07.043s
[INFO] Finished at: Sat Mar 09 12:04:38 UTC 2013
[INFO] Final Memory: 41M/286M
[INFO] ------------------------------------------------------------------------
[JENKINS] Archiving <https://builds.apache.org/job/HttpComponents%20Client/ws/httpclient-trunk/httpclient/pom.xml>
to /home/hudson/hudson/jobs/HttpComponents Client/modules/org.apache.httpcomponents$httpclient/builds/2013-03-09_12-02-13/archive/org.apache.httpcomponents/httpclient/4.3-alpha2-SNAPSHOT/httpclient-4.3-alpha2-SNAPSHOT.pom
[JENKINS] Archiving <https://builds.apache.org/job/HttpComponents%20Client/ws/httpclient-trunk/httpclient/target/httpclient-4.3-alpha2-SNAPSHOT.jar>
to /home/hudson/hudson/jobs/HttpComponents Client/modules/org.apache.httpcomponents$httpclient/builds/2013-03-09_12-02-13/archive/org.apache.httpcomponents/httpclient/4.3-alpha2-SNAPSHOT/httpclient-4.3-alpha2-SNAPSHOT.jar
[JENKINS] Archiving <https://builds.apache.org/job/HttpComponents%20Client/ws/httpclient-trunk/httpclient/target/httpclient-4.3-alpha2-SNAPSHOT-tests.jar>
to /home/hudson/hudson/jobs/HttpComponents Client/modules/org.apache.httpcomponents$httpclient/builds/2013-03-09_12-02-13/archive/org.apache.httpcomponents/httpclient/4.3-alpha2-SNAPSHOT/httpclient-4.3-alpha2-SNAPSHOT-tests.jar
[JENKINS] Archiving <https://builds.apache.org/job/HttpComponents%20Client/ws/httpclient-trunk/httpclient/target/httpclient-4.3-alpha2-SNAPSHOT-sources.jar>
to /home/hudson/hudson/jobs/HttpComponents Client/modules/org.apache.httpcomponents$httpclient/builds/2013-03-09_12-02-13/archive/org.apache.httpcomponents/httpclient/4.3-alpha2-SNAPSHOT/httpclient-4.3-alpha2-SNAPSHOT-sources.jar
[JENKINS] Archiving <https://builds.apache.org/job/HttpComponents%20Client/ws/httpclient-trunk/pom.xml>
to /home/hudson/hudson/jobs/HttpComponents Client/modules/org.apache.httpcomponents$httpcomponents-client/builds/2013-03-09_12-02-12/archive/org.apache.httpcomponents/httpcomponents-client/4.3-alpha2-SNAPSHOT/httpcomponents-client-4.3-alpha2-SNAPSHOT.pom
[JENKINS] Archiving <https://builds.apache.org/job/HttpComponents%20Client/ws/httpclient-trunk/target/httpcomponents-client-4.3-alpha2-SNAPSHOT-site.xml>
to /home/hudson/hudson/jobs/HttpComponents Client/modules/org.apache.httpcomponents$httpcomponents-client/builds/2013-03-09_12-02-12/archive/org.apache.httpcomponents/httpcomponents-client/4.3-alpha2-SNAPSHOT/httpcomponents-client-4.3-alpha2-SNAPSHOT-site.xml
[JENKINS] Archiving <https://builds.apache.org/job/HttpComponents%20Client/ws/httpclient-trunk/httpclient-osgi/pom.xml>
to /home/hudson/hudson/jobs/HttpComponents Client/modules/org.apache.httpcomponents$httpclient-osgi/builds/2013-03-09_12-02-13/archive/org.apache.httpcomponents/httpclient-osgi/4.3-alpha2-SNAPSHOT/httpclient-osgi-4.3-alpha2-SNAPSHOT.pom
[JENKINS] Archiving <https://builds.apache.org/job/HttpComponents%20Client/ws/httpclient-trunk/fluent-hc/pom.xml>
to /home/hudson/hudson/jobs/HttpComponents Client/modules/org.apache.httpcomponents$fluent-hc/builds/2013-03-09_12-02-13/archive/org.apache.httpcomponents/fluent-hc/4.3-alpha2-SNAPSHOT/fluent-hc-4.3-alpha2-SNAPSHOT.pom
[JENKINS] Archiving <https://builds.apache.org/job/HttpComponents%20Client/ws/httpclient-trunk/fluent-hc/target/fluent-hc-4.3-alpha2-SNAPSHOT.jar>
to /home/hudson/hudson/jobs/HttpComponents Client/modules/org.apache.httpcomponents$fluent-hc/builds/2013-03-09_12-02-13/archive/org.apache.httpcomponents/fluent-hc/4.3-alpha2-SNAPSHOT/fluent-hc-4.3-alpha2-SNAPSHOT.jar
[JENKINS] Archiving <https://builds.apache.org/job/HttpComponents%20Client/ws/httpclient-trunk/fluent-hc/target/fluent-hc-4.3-alpha2-SNAPSHOT-sources.jar>
to /home/hudson/hudson/jobs/HttpComponents Client/modules/org.apache.httpcomponents$fluent-hc/builds/2013-03-09_12-02-13/archive/org.apache.httpcomponents/fluent-hc/4.3-alpha2-SNAPSHOT/fluent-hc-4.3-alpha2-SNAPSHOT-sources.jar
[JENKINS] Archiving <https://builds.apache.org/job/HttpComponents%20Client/ws/httpclient-trunk/httpmime/pom.xml>
to /home/hudson/hudson/jobs/HttpComponents Client/modules/org.apache.httpcomponents$httpmime/builds/2013-03-09_12-02-13/archive/org.apache.httpcomponents/httpmime/4.3-alpha2-SNAPSHOT/httpmime-4.3-alpha2-SNAPSHOT.pom
[JENKINS] Archiving <https://builds.apache.org/job/HttpComponents%20Client/ws/httpclient-trunk/httpmime/target/httpmime-4.3-alpha2-SNAPSHOT.jar>
to /home/hudson/hudson/jobs/HttpComponents Client/modules/org.apache.httpcomponents$httpmime/builds/2013-03-09_12-02-13/archive/org.apache.httpcomponents/httpmime/4.3-alpha2-SNAPSHOT/httpmime-4.3-alpha2-SNAPSHOT.jar
[JENKINS] Archiving <https://builds.apache.org/job/HttpComponents%20Client/ws/httpclient-trunk/httpmime/target/httpmime-4.3-alpha2-SNAPSHOT-sources.jar>
to /home/hudson/hudson/jobs/HttpComponents Client/modules/org.apache.httpcomponents$httpmime/builds/2013-03-09_12-02-13/archive/org.apache.httpcomponents/httpmime/4.3-alpha2-SNAPSHOT/httpmime-4.3-alpha2-SNAPSHOT-sources.jar
[JENKINS] Archiving <https://builds.apache.org/job/HttpComponents%20Client/ws/httpclient-trunk/httpclient-cache/pom.xml>
to /home/hudson/hudson/jobs/HttpComponents Client/modules/org.apache.httpcomponents$httpclient-cache/builds/2013-03-09_12-02-13/archive/org.apache.httpcomponents/httpclient-cache/4.3-alpha2-SNAPSHOT/httpclient-cache-4.3-alpha2-SNAPSHOT.pom
[JENKINS] Archiving <https://builds.apache.org/job/HttpComponents%20Client/ws/httpclient-trunk/httpclient-cache/target/httpclient-cache-4.3-alpha2-SNAPSHOT.jar>
to /home/hudson/hudson/jobs/HttpComponents Client/modules/org.apache.httpcomponents$httpclient-cache/builds/2013-03-09_12-02-13/archive/org.apache.httpcomponents/httpclient-cache/4.3-alpha2-SNAPSHOT/httpclient-cache-4.3-alpha2-SNAPSHOT.jar
[JENKINS] Archiving <https://builds.apache.org/job/HttpComponents%20Client/ws/httpclient-trunk/httpclient-cache/target/httpclient-cache-4.3-alpha2-SNAPSHOT-sources.jar>
to /home/hudson/hudson/jobs/HttpComponents Client/modules/org.apache.httpcomponents$httpclient-cache/builds/2013-03-09_12-02-13/archive/org.apache.httpcomponents/httpclient-cache/4.3-alpha2-SNAPSHOT/httpclient-cache-4.3-alpha2-SNAPSHOT-sources.jar
Waiting for Jenkins to finish collecting data
mavenExecutionResult exceptions not empty
message : Failed to execute goal org.apache.felix:maven-bundle-plugin:2.3.7:bundle (default-bundle)
on project httpclient-osgi: Error(s) found in bundle configuration
cause : Error(s) found in bundle configuration
Stack trace : 
org.apache.maven.lifecycle.LifecycleExecutionException: Failed to execute goal org.apache.felix:maven-bundle-plugin:2.3.7:bundle
(default-bundle) on project httpclient-osgi: Error(s) found in bundle configuration
	at org.apache.maven.lifecycle.internal.MojoExecutor.execute(MojoExecutor.java:217)
	at org.apache.maven.lifecycle.internal.MojoExecutor.execute(MojoExecutor.java:153)
	at org.apache.maven.lifecycle.internal.MojoExecutor.execute(MojoExecutor.java:145)
	at org.apache.maven.lifecycle.internal.LifecycleModuleBuilder.buildProject(LifecycleModuleBuilder.java:84)
	at org.apache.maven.lifecycle.internal.LifecycleModuleBuilder.buildProject(LifecycleModuleBuilder.java:59)
	at org.apache.maven.lifecycle.internal.LifecycleStarter.singleThreadedBuild(LifecycleStarter.java:183)
	at org.apache.maven.lifecycle.internal.LifecycleStarter.execute(LifecycleStarter.java:161)
	at org.apache.maven.DefaultMaven.doExecute(DefaultMaven.java:319)
	at org.apache.maven.DefaultMaven.execute(DefaultMaven.java:156)
	at org.jvnet.hudson.maven3.launcher.Maven3Launcher.main(Maven3Launcher.java:79)
	at sun.reflect.NativeMethodAccessorImpl.invoke0(Native Method)
	at sun.reflect.NativeMethodAccessorImpl.invoke(NativeMethodAccessorImpl.java:39)
	at sun.reflect.DelegatingMethodAccessorImpl.invoke(DelegatingMethodAccessorImpl.java:25)
	at java.lang.reflect.Method.invoke(Method.java:592)
	at org.codehaus.plexus.classworlds.launcher.Launcher.launchStandard(Launcher.java:329)
	at org.codehaus.plexus.classworlds.launcher.Launcher.launch(Launcher.java:239)
	at org.jvnet.hudson.maven3.agent.Maven3Main.launch(Maven3Main.java:158)
	at hudson.maven.Maven3Builder.call(Maven3Builder.java:100)
	at hudson.maven.Maven3Builder.call(Maven3Builder.java:66)
	at hudson.remoting.UserRequest.perform(UserRequest.java:118)
	at hudson.remoting.UserRequest.perform(UserRequest.java:48)
	at hudson.remoting.Request$2.run(Request.java:326)
	at hudson.remoting.InterceptingExecutorService$1.call(InterceptingExecutorService.java:72)
	at java.util.concurrent.FutureTask$Sync.innerRun(FutureTask.java:269)
	at java.util.concurrent.FutureTask.run(FutureTask.java:123)
	at java.util.concurrent.ThreadPoolExecutor$Worker.runTask(ThreadPoolExecutor.java:651)
	at java.util.concurrent.ThreadPoolExecutor$Worker.run(ThreadPoolExecutor.java:676)
	at java.lang.Thread.run(Thread.java:595)
Caused by: org.apache.maven.plugin.MojoExecutionException: Error(s) found in bundle configuration
	at org.apache.felix.bundleplugin.BundlePlugin.execute(BundlePlugin.java:407)
	at org.apache.felix.bundleplugin.BundlePlugin.execute(BundlePlugin.java:264)
	at org.apache.felix.bundleplugin.BundlePlugin.execute(BundlePlugin.java:255)
	at org.apache.maven.plugin.DefaultBuildPluginManager.executeMojo(DefaultBuildPluginManager.java:101)
	at org.apache.maven.lifecycle.internal.MojoExecutor.execute(MojoExecutor.java:209)
	... 27 more
Caused by: org.apache.maven.plugin.MojoFailureException: Error(s) found in bundle configuration
	at org.apache.felix.bundleplugin.BundlePlugin.execute(BundlePlugin.java:356)
	... 31 more
Sending e-mails to: commits@hc.apache.org
channel stopped

Mime
View raw message