hc-commits mailing list archives

Site index · List index
Message view « Date » · « Thread »
Top « Date » · « Thread »
From Apache Jenkins Server <jenk...@builds.apache.org>
Subject Build failed in Jenkins: HttpComponents Client (4.2.x) » HttpClient OSGi bundle #51
Date Sat, 09 Mar 2013 12:09:25 GMT
See <https://builds.apache.org/job/HttpComponents%20Client%20(4.2.x)/org.apache.httpcomponents$httpclient-osgi/51/>

------------------------------------------
[INFO] ------------------------------------------------------------------------
[INFO] Building HttpClient OSGi bundle
[INFO]    task-segment: [clean, install]
[INFO] ------------------------------------------------------------------------
[INFO] [clean:clean {execution: default-clean}]
[INFO] Deleting <https://builds.apache.org/job/HttpComponents%20Client%20(4.2.x)/org.apache.httpcomponents$httpclient-osgi/ws/target>
[INFO] [notice:generate {execution: attach-notice-license}]
[INFO] Generating NOTICE and LICENSE resources
[INFO] [buildnumber:create {execution: default}]
[INFO] Checking for local modifications: skipped.
[INFO] Updating project files from SCM: skipped.
[INFO] Executing: /bin/sh -c cd "<https://builds.apache.org/job/HttpComponents%20Client%20(4.2.x)/org.apache.httpcomponents$httpclient-osgi/ws/">
&& svn --non-interactive info
[INFO] Working directory: <https://builds.apache.org/job/HttpComponents%20Client%20(4.2.x)/org.apache.httpcomponents$httpclient-osgi/ws/>
[INFO] Storing buildNumber: 1433124 at timestamp: 1362831049690
[INFO] Executing: /bin/sh -c cd "<https://builds.apache.org/job/HttpComponents%20Client%20(4.2.x)/org.apache.httpcomponents$httpclient-osgi/ws/">
&& svn --non-interactive info
[INFO] Working directory: <https://builds.apache.org/job/HttpComponents%20Client%20(4.2.x)/org.apache.httpcomponents$httpclient-osgi/ws/>
[INFO] Storing buildScmBranch: branches/4.2.x/httpclient-osgi
[debug] execute contextualize
[INFO] [resources:resources {execution: default-resources}]
[INFO] Using 'UTF-8' encoding to copy filtered resources.
[INFO] skip non existing resourceDirectory <https://builds.apache.org/job/HttpComponents%20Client%20(4.2.x)/org.apache.httpcomponents$httpclient-osgi/ws/src/main/resources>
[INFO] Copying 2 resources to META-INF
[INFO] [compiler:compile {execution: default-compile}]
[INFO] No sources to compile
[debug] execute contextualize
[INFO] [resources:testResources {execution: default-testResources}]
[INFO] Using 'UTF-8' encoding to copy filtered resources.
[INFO] skip non existing resourceDirectory <https://builds.apache.org/job/HttpComponents%20Client%20(4.2.x)/org.apache.httpcomponents$httpclient-osgi/ws/src/test/resources>
[INFO] Copying 2 resources to META-INF
[INFO] [compiler:testCompile {execution: default-testCompile}]
[INFO] No sources to compile
[INFO] [surefire:test {execution: default-test}]
[INFO] Surefire report directory: <https://builds.apache.org/job/HttpComponents%20Client%20(4.2.x)/org.apache.httpcomponents$httpclient-osgi/ws/target/surefire-reports>

-------------------------------------------------------
 T E S T S
-------------------------------------------------------

Results :

Tests run: 0, Failures: 0, Errors: 0, Skipped: 0

[JENKINS] Recording test results[INFO] [bundle:bundle {execution: default-bundle}]

[ERROR] Bundle org.apache.httpcomponents:httpclient-osgi:bundle:4.2.4-SNAPSHOT : Unresolved
references to [javax.net] by class(es) on the Bundle-Classpath[Jar:dot]: [org/apache/http/conn/ssl/SSLSocketFactory.class]
[ERROR] Error(s) found in bundle configuration
[JENKINS] Archiving <https://builds.apache.org/job/HttpComponents%20Client%20(4.2.x)/org.apache.httpcomponents$httpclient-osgi/ws/pom.xml>
to /home/hudson/hudson/jobs/HttpComponents Client (4.2.x)/modules/org.apache.httpcomponents$httpclient-osgi/builds/2013-03-09_12-01-05/archive/org.apache.httpcomponents/httpclient-osgi/4.2.4-SNAPSHOT/httpclient-osgi-4.2.4-SNAPSHOT.pom
[INFO] ------------------------------------------------------------------------
[ERROR] BUILD ERROR
[INFO] ------------------------------------------------------------------------
[INFO] Error(s) found in bundle configuration
[INFO] ------------------------------------------------------------------------
[INFO] For more information, run Maven with the -e switch
[INFO] ------------------------------------------------------------------------
[INFO] Total time: 5 minutes 41 seconds
[INFO] Finished at: Sat Mar 09 12:10:56 GMT+00:00 2013
[INFO] Final Memory: 70M/215M
[INFO] ------------------------------------------------------------------------

Mime
View raw message