hc-commits mailing list archives

Site index · List index
Message view « Date » · « Thread »
Top « Date » · « Thread »
From Apache Jenkins Server <jenk...@builds.apache.org>
Subject Build failed in Jenkins: HttpComponents Client #542
Date Thu, 24 Jan 2013 12:13:42 GMT
See <https://builds.apache.org/job/HttpComponents%20Client/542/changes>

Changes:

[olegk] HTTPCLIENT-1298: Add AsynchronousValidator in HttpClientBuilder's list of closeable
objects
Contributed by Martin Meinhold <mmeinhold at atlassian.com>

* Resolve constructor dependency between CachingExec and AsynchronousValidator
* AsynchronousValidator implements Closeable interface

------------------------------------------
[...truncated 400 lines...]
[INFO] 
[INFO] --- maven-clean-plugin:2.4.1:clean (default-clean) @ httpmime ---[INFO] Deleting <https://builds.apache.org/job/HttpComponents%20Client/ws/httpclient-trunk/httpmime/target>

mojoSucceeded org.apache.maven.plugins:maven-clean-plugin:2.4.1(default-clean)
mojoStarted org.apache.maven.plugins:maven-checkstyle-plugin:2.9.1(validate)
[INFO] 
[INFO] --- maven-checkstyle-plugin:2.9.1:checkstyle (validate) @ httpmime ---
[INFO] Starting audit...
Audit done.

mojoSucceeded org.apache.maven.plugins:maven-checkstyle-plugin:2.9.1(validate)
mojoStarted org.apache.httpcomponents:maven-notice-plugin:0.0.2(attach-notice-license)[INFO]
Generating NOTICE and LICENSE resources

[INFO] 
[INFO] --- maven-notice-plugin:0.0.2:generate (attach-notice-license) @ httpmime ---
mojoSucceeded org.apache.httpcomponents:maven-notice-plugin:0.0.2(attach-notice-license)
mojoStarted org.codehaus.mojo:buildnumber-maven-plugin:1.0(default)
[INFO] Checking for local modifications: skipped.
[INFO] 
[INFO] Updating project files from SCM: skipped.
[INFO] Executing: /bin/sh -c cd "<https://builds.apache.org/job/HttpComponents%20Client/ws/httpclient-trunk/httpmime">
&& svn --non-interactive info
[INFO] Working directory: <https://builds.apache.org/job/HttpComponents%20Client/ws/httpclient-trunk/httpmime>
[INFO] --- buildnumber-maven-plugin:1.0:create (default) @ httpmime ---
[INFO] Storing buildNumber: 1435976 at timestamp: 1359029549362
[INFO] Executing: /bin/sh -c cd "<https://builds.apache.org/job/HttpComponents%20Client/ws/httpclient-trunk/httpmime">
&& svn --non-interactive info
[INFO] Working directory: <https://builds.apache.org/job/HttpComponents%20Client/ws/httpclient-trunk/httpmime>
[INFO] Storing buildScmBranch: trunk
mojoSucceeded org.codehaus.mojo:buildnumber-maven-plugin:1.0(default)
mojoStarted org.apache.maven.plugins:maven-resources-plugin:2.5(default-resources)
[INFO] 
[debug] execute contextualize
[WARNING] File encoding has not been set, using platform encoding ISO646-US, i.e. build is
platform dependent!
[WARNING] Using platform encoding (ISO646-US actually) to copy filtered resources, i.e. build
is platform dependent!
[INFO] Copying 1 resource
[INFO] Copying 2 resources to META-INF
[INFO] --- maven-resources-plugin:2.5:resources (default-resources) @ httpmime ---
mojoSucceeded org.apache.maven.plugins:maven-resources-plugin:2.5(default-resources)
mojoStarted org.apache.maven.plugins:maven-compiler-plugin:2.3.2(default-compile)
[INFO] [WARNING] File encoding has not been set, using platform encoding ISO646-US, i.e. build
is platform dependent!

[INFO] --- maven-compiler-plugin:2.3.2:compile (default-compile) @ httpmime ---[INFO] Compiling
15 source files to <https://builds.apache.org/job/HttpComponents%20Client/ws/httpclient-trunk/httpmime/target/classes>

mojoSucceeded org.apache.maven.plugins:maven-compiler-plugin:2.3.2(default-compile)
mojoStarted org.apache.maven.plugins:maven-resources-plugin:2.5(default-testResources)
[INFO] 
[debug] execute contextualize
[WARNING] Using platform encoding (ISO646-US actually) to copy filtered resources, i.e. build
is platform dependent!
[INFO] skip non existing resourceDirectory <https://builds.apache.org/job/HttpComponents%20Client/ws/httpclient-trunk/httpmime/src/test/resources>
[INFO] Copying 2 resources to META-INF
[INFO] --- maven-resources-plugin:2.5:testResources (default-testResources) @ httpmime ---
mojoSucceeded org.apache.maven.plugins:maven-resources-plugin:2.5(default-testResources)
mojoStarted org.apache.maven.plugins:maven-compiler-plugin:2.3.2(default-testCompile)
[INFO] 
[WARNING] File encoding has not been set, using platform encoding ISO646-US, i.e. build is
platform dependent!
[INFO] Compiling 4 source files to <https://builds.apache.org/job/HttpComponents%20Client/ws/httpclient-trunk/httpmime/target/test-classes>
[INFO] --- maven-compiler-plugin:2.3.2:testCompile (default-testCompile) @ httpmime ---
mojoSucceeded org.apache.maven.plugins:maven-compiler-plugin:2.3.2(default-testCompile)
mojoStarted org.apache.maven.plugins:maven-surefire-plugin:2.9(default-test)
[INFO] 
[INFO] Surefire report directory: <https://builds.apache.org/job/HttpComponents%20Client/ws/httpclient-trunk/httpmime/target/surefire-reports>

-------------------------------------------------------
 T E S T S
-------------------------------------------------------
[INFO] --- maven-surefire-plugin:2.9:test (default-test) @ httpmime ---
Running org.apache.http.entity.mime.TestMultipartEntityBuilder
Tests run: 3, Failures: 0, Errors: 0, Skipped: 0, Time elapsed: 0.137 sec
Running org.apache.http.entity.mime.TestMultipartContentBody
Tests run: 2, Failures: 0, Errors: 0, Skipped: 0, Time elapsed: 0 sec
Running org.apache.http.entity.mime.TestMultipartFormHttpEntity
Tests run: 4, Failures: 0, Errors: 0, Skipped: 0, Time elapsed: 0.01 sec
Running org.apache.http.entity.mime.TestMultipartForm
Tests run: 5, Failures: 0, Errors: 0, Skipped: 0, Time elapsed: 0.165 sec

Results :

Tests run: 14, Failures: 0, Errors: 0, Skipped: 0

mojoSucceeded org.apache.maven.plugins:maven-surefire-plugin:2.9(default-test)
[JENKINS] Recording test results
mojoStarted org.apache.maven.plugins:maven-jar-plugin:2.3.2(default-jar)
[INFO] 
[INFO] --- maven-jar-plugin:2.3.2:jar (default-jar) @ httpmime ---
[INFO] Building jar: <https://builds.apache.org/job/HttpComponents%20Client/ws/httpclient-trunk/httpmime/target/httpmime-4.3-alpha2-SNAPSHOT.jar>
mojoSucceeded org.apache.maven.plugins:maven-jar-plugin:2.3.2(default-jar)
forkedProjectStarted org.apache.httpcomponents:httpmime:4.3-alpha2-SNAPSHOT
mojoStarted org.apache.maven.plugins:maven-checkstyle-plugin:2.9.1(validate)
[INFO] 
[INFO] [INFO] Starting audit...
Audit done.

--- maven-checkstyle-plugin:2.9.1:checkstyle (validate) @ httpmime ---
mojoSucceeded org.apache.maven.plugins:maven-checkstyle-plugin:2.9.1(validate)
forkedProjectSucceeded org.apache.httpcomponents:httpmime:4.3-alpha2-SNAPSHOTJan 24, 2013
12:12:44 PM hudson.maven.ExecutedMojo <init>
WARNING: Failed to getClass for org.apache.maven.plugin.source.SourceJarMojo

mojoStarted org.apache.maven.plugins:maven-source-plugin:2.1.2(attach-sources)
[INFO] 
[INFO] --- maven-source-plugin:2.1.2:jar (attach-sources) @ httpmime ---
[INFO] Building jar: <https://builds.apache.org/job/HttpComponents%20Client/ws/httpclient-trunk/httpmime/target/httpmime-4.3-alpha2-SNAPSHOT-sources.jar>
mojoSucceeded org.apache.maven.plugins:maven-source-plugin:2.1.2(attach-sources)
mojoStarted org.apache.maven.plugins:maven-site-plugin:3.0(attach-descriptor)
[INFO] 
[INFO] --- maven-site-plugin:3.0:attach-descriptor (attach-descriptor) @ httpmime ---
mojoSucceeded org.apache.maven.plugins:maven-site-plugin:3.0(attach-descriptor)
mojoStarted org.apache.maven.plugins:maven-install-plugin:2.3.1(default-install)
[INFO] 
[INFO] Installing <https://builds.apache.org/job/HttpComponents%20Client/ws/httpclient-trunk/httpmime/target/httpmime-4.3-alpha2-SNAPSHOT.jar>
to /export/home/hudson/hudson-slave/maven-repositories/1/org/apache/httpcomponents/httpmime/4.3-alpha2-SNAPSHOT/httpmime-4.3-alpha2-SNAPSHOT.jar
[INFO] Installing <https://builds.apache.org/job/HttpComponents%20Client/ws/httpclient-trunk/httpmime/pom.xml>
to /export/home/hudson/hudson-slave/maven-repositories/1/org/apache/httpcomponents/httpmime/4.3-alpha2-SNAPSHOT/httpmime-4.3-alpha2-SNAPSHOT.pom
[INFO] Installing <https://builds.apache.org/job/HttpComponents%20Client/ws/httpclient-trunk/httpmime/target/httpmime-4.3-alpha2-SNAPSHOT-sources.jar>
to /export/home/hudson/hudson-slave/maven-repositories/1/org/apache/httpcomponents/httpmime/4.3-alpha2-SNAPSHOT/httpmime-4.3-alpha2-SNAPSHOT-sources.jar
[INFO] --- maven-install-plugin:2.3.1:install (default-install) @ httpmime ---
mojoSucceeded org.apache.maven.plugins:maven-install-plugin:2.3.1(default-install)
projectSucceeded org.apache.httpcomponents:httpmime:4.3-alpha2-SNAPSHOT
projectStarted org.apache.httpcomponents:httpclient-cache:4.3-alpha2-SNAPSHOT
[INFO]                                                                         
[INFO] ------------------------------------------------------------------------
[INFO] Building HttpClient Cache 4.3-alpha2-SNAPSHOT
[INFO] ------------------------------------------------------------------------
mojoStarted org.apache.maven.plugins:maven-clean-plugin:2.4.1(default-clean)
[INFO] 
[INFO] Deleting <https://builds.apache.org/job/HttpComponents%20Client/ws/httpclient-trunk/httpclient-cache/target>
[INFO] --- maven-clean-plugin:2.4.1:clean (default-clean) @ httpclient-cache ---
mojoSucceeded org.apache.maven.plugins:maven-clean-plugin:2.4.1(default-clean)
mojoStarted org.apache.maven.plugins:maven-checkstyle-plugin:2.9.1(validate)
[INFO] 
[INFO] --- maven-checkstyle-plugin:2.9.1:checkstyle (validate) @ httpclient-cache ---
[INFO] Starting audit...
Audit done.

mojoSucceeded org.apache.maven.plugins:maven-checkstyle-plugin:2.9.1(validate)
mojoStarted org.apache.httpcomponents:maven-notice-plugin:0.0.2(attach-notice-license)[INFO]
Generating NOTICE and LICENSE resources

[INFO] 
[INFO] --- maven-notice-plugin:0.0.2:generate (attach-notice-license) @ httpclient-cache ---
mojoSucceeded org.apache.httpcomponents:maven-notice-plugin:0.0.2(attach-notice-license)
mojoStarted org.codehaus.mojo:buildnumber-maven-plugin:1.0(default)
[INFO] 
[INFO] Checking for local modifications: skipped.
[INFO] Updating project files from SCM: skipped.
[INFO] Executing: /bin/sh -c cd "<https://builds.apache.org/job/HttpComponents%20Client/ws/httpclient-trunk/httpclient-cache">
&& svn --non-interactive info
[INFO] Working directory: <https://builds.apache.org/job/HttpComponents%20Client/ws/httpclient-trunk/httpclient-cache>
[INFO] --- buildnumber-maven-plugin:1.0:create (default) @ httpclient-cache ---
[INFO] Storing buildNumber: 1437952 at timestamp: 1359029581258
[INFO] Executing: /bin/sh -c cd "<https://builds.apache.org/job/HttpComponents%20Client/ws/httpclient-trunk/httpclient-cache">
&& svn --non-interactive info
[INFO] Working directory: <https://builds.apache.org/job/HttpComponents%20Client/ws/httpclient-trunk/httpclient-cache>
[INFO] Storing buildScmBranch: trunk
mojoSucceeded org.codehaus.mojo:buildnumber-maven-plugin:1.0(default)
mojoStarted org.apache.maven.plugins:maven-resources-plugin:2.5(default-resources)
[INFO] 
[debug] execute contextualize
[WARNING] File encoding has not been set, using platform encoding ISO646-US, i.e. build is
platform dependent!
[WARNING] Using platform encoding (ISO646-US actually) to copy filtered resources, i.e. build
is platform dependent!
[INFO] skip non existing resourceDirectory <https://builds.apache.org/job/HttpComponents%20Client/ws/httpclient-trunk/httpclient-cache/src/main/resources>
[INFO] Copying 2 resources to META-INF
[INFO] --- maven-resources-plugin:2.5:resources (default-resources) @ httpclient-cache ---
mojoSucceeded org.apache.maven.plugins:maven-resources-plugin:2.5(default-resources)
mojoStarted org.apache.maven.plugins:maven-compiler-plugin:2.3.2(default-compile)
[INFO] 
[WARNING] File encoding has not been set, using platform encoding ISO646-US, i.e. build is
platform dependent!
[INFO] Compiling 64 source files to <https://builds.apache.org/job/HttpComponents%20Client/ws/httpclient-trunk/httpclient-cache/target/classes>
[INFO] --- maven-compiler-plugin:2.3.2:compile (default-compile) @ httpclient-cache ---
[INFO] -------------------------------------------------------------
[ERROR] COMPILATION ERROR : 
[INFO] -------------------------------------------------------------
[ERROR] <https://builds.apache.org/job/HttpComponents%20Client/ws/httpclient-trunk/httpclient-cache/src/main/java/org/apache/http/impl/client/cache/AsynchronousValidator.java>:[90,5]
method does not override a method from its superclass
[INFO] 1 error
[INFO] -------------------------------------------------------------
mojoFailed org.apache.maven.plugins:maven-compiler-plugin:2.3.2(default-compile)
projectFailed org.apache.httpcomponents:httpclient-cache:4.3-alpha2-SNAPSHOT
sessionEnded
[INFO] ------------------------------------------------------------------------
[INFO] Reactor Summary:
[INFO] 
[INFO] HttpComponents Client ............................. SUCCESS [3:16.991s]
[INFO] HttpClient ........................................ SUCCESS [3:10.924s]
[INFO] HttpMime .......................................... SUCCESS [28.144s]
[INFO] HttpClient Cache .................................. FAILURE [15.423s]
[INFO] Fluent HttpClient ................................. SKIPPED
[INFO] HttpClient OSGi bundle ............................ SKIPPED
[INFO] ------------------------------------------------------------------------
[INFO] BUILD FAILURE
[INFO] ------------------------------------------------------------------------
[INFO] Total time: 7:53.266s
[INFO] Finished at: Thu Jan 24 12:13:09 GMT+00:00 2013
[INFO] Final Memory: 27M/192M
[INFO] ------------------------------------------------------------------------
Projects to build: [MavenProject: org.apache.httpcomponents:httpcomponents-client:4.3-alpha2-SNAPSHOT
@ <https://builds.apache.org/job/HttpComponents%20Client/ws/httpclient-trunk/pom.xml,>
MavenProject: org.apache.httpcomponents:httpclient:4.3-alpha2-SNAPSHOT @ <https://builds.apache.org/job/HttpComponents%20Client/ws/httpclient-trunk/httpclient/pom.xml,>
MavenProject: org.apache.httpcomponents:httpmime:4.3-alpha2-SNAPSHOT @ <https://builds.apache.org/job/HttpComponents%20Client/ws/httpclient-trunk/httpmime/pom.xml,>
MavenProject: org.apache.httpcomponents:httpclient-cache:4.3-alpha2-SNAPSHOT @ <https://builds.apache.org/job/HttpComponents%20Client/ws/httpclient-trunk/httpclient-cache/pom.xml,>
MavenProject: org.apache.httpcomponents:fluent-hc:4.3-alpha2-SNAPSHOT @ <https://builds.apache.org/job/HttpComponents%20Client/ws/httpclient-trunk/fluent-hc/pom.xml,>
MavenProject: org.apache.httpcomponents:httpclient-osgi:4.3-alpha2-SNAPSHOT @ <https://builds.apache.org/job/HttpComponents%20Client/ws/httpclient-trunk/httpclient-osgi/pom.xml]>
[JENKINS] Archiving <https://builds.apache.org/job/HttpComponents%20Client/ws/httpclient-trunk/httpclient/pom.xml>
to /home/hudson/hudson/jobs/HttpComponents Client/modules/org.apache.httpcomponents$httpclient/builds/2013-01-24_12-02-27/archive/org.apache.httpcomponents/httpclient/4.3-alpha2-SNAPSHOT/httpclient-4.3-alpha2-SNAPSHOT.pom
[JENKINS] Archiving <https://builds.apache.org/job/HttpComponents%20Client/ws/httpclient-trunk/httpclient/target/httpclient-4.3-alpha2-SNAPSHOT.jar>
to /home/hudson/hudson/jobs/HttpComponents Client/modules/org.apache.httpcomponents$httpclient/builds/2013-01-24_12-02-27/archive/org.apache.httpcomponents/httpclient/4.3-alpha2-SNAPSHOT/httpclient-4.3-alpha2-SNAPSHOT.jar
[JENKINS] Archiving <https://builds.apache.org/job/HttpComponents%20Client/ws/httpclient-trunk/httpclient/target/httpclient-4.3-alpha2-SNAPSHOT-tests.jar>
to /home/hudson/hudson/jobs/HttpComponents Client/modules/org.apache.httpcomponents$httpclient/builds/2013-01-24_12-02-27/archive/org.apache.httpcomponents/httpclient/4.3-alpha2-SNAPSHOT/httpclient-4.3-alpha2-SNAPSHOT-tests.jar
[JENKINS] Archiving <https://builds.apache.org/job/HttpComponents%20Client/ws/httpclient-trunk/httpclient/target/httpclient-4.3-alpha2-SNAPSHOT-sources.jar>
to /home/hudson/hudson/jobs/HttpComponents Client/modules/org.apache.httpcomponents$httpclient/builds/2013-01-24_12-02-27/archive/org.apache.httpcomponents/httpclient/4.3-alpha2-SNAPSHOT/httpclient-4.3-alpha2-SNAPSHOT-sources.jar
[JENKINS] Archiving <https://builds.apache.org/job/HttpComponents%20Client/ws/httpclient-trunk/pom.xml>
to /home/hudson/hudson/jobs/HttpComponents Client/modules/org.apache.httpcomponents$httpcomponents-client/builds/2013-01-24_12-02-27/archive/org.apache.httpcomponents/httpcomponents-client/4.3-alpha2-SNAPSHOT/httpcomponents-client-4.3-alpha2-SNAPSHOT.pom
[JENKINS] Archiving <https://builds.apache.org/job/HttpComponents%20Client/ws/httpclient-trunk/target/httpcomponents-client-4.3-alpha2-SNAPSHOT-site.xml>
to /home/hudson/hudson/jobs/HttpComponents Client/modules/org.apache.httpcomponents$httpcomponents-client/builds/2013-01-24_12-02-27/archive/org.apache.httpcomponents/httpcomponents-client/4.3-alpha2-SNAPSHOT/httpcomponents-client-4.3-alpha2-SNAPSHOT-site.xml
[JENKINS] Archiving <https://builds.apache.org/job/HttpComponents%20Client/ws/httpclient-trunk/httpclient-osgi/pom.xml>
to /home/hudson/hudson/jobs/HttpComponents Client/modules/org.apache.httpcomponents$httpclient-osgi/builds/2013-01-24_12-02-29/archive/org.apache.httpcomponents/httpclient-osgi/4.3-alpha2-SNAPSHOT/httpclient-osgi-4.3-alpha2-SNAPSHOT.pom
[JENKINS] Archiving <https://builds.apache.org/job/HttpComponents%20Client/ws/httpclient-trunk/fluent-hc/pom.xml>
to /home/hudson/hudson/jobs/HttpComponents Client/modules/org.apache.httpcomponents$fluent-hc/builds/2013-01-24_12-02-28/archive/org.apache.httpcomponents/fluent-hc/4.3-alpha2-SNAPSHOT/fluent-hc-4.3-alpha2-SNAPSHOT.pom
[JENKINS] Archiving <https://builds.apache.org/job/HttpComponents%20Client/ws/httpclient-trunk/httpmime/pom.xml>
to /home/hudson/hudson/jobs/HttpComponents Client/modules/org.apache.httpcomponents$httpmime/builds/2013-01-24_12-02-28/archive/org.apache.httpcomponents/httpmime/4.3-alpha2-SNAPSHOT/httpmime-4.3-alpha2-SNAPSHOT.pom
[JENKINS] Archiving <https://builds.apache.org/job/HttpComponents%20Client/ws/httpclient-trunk/httpmime/target/httpmime-4.3-alpha2-SNAPSHOT.jar>
to /home/hudson/hudson/jobs/HttpComponents Client/modules/org.apache.httpcomponents$httpmime/builds/2013-01-24_12-02-28/archive/org.apache.httpcomponents/httpmime/4.3-alpha2-SNAPSHOT/httpmime-4.3-alpha2-SNAPSHOT.jar
[JENKINS] Archiving <https://builds.apache.org/job/HttpComponents%20Client/ws/httpclient-trunk/httpmime/target/httpmime-4.3-alpha2-SNAPSHOT-sources.jar>
to /home/hudson/hudson/jobs/HttpComponents Client/modules/org.apache.httpcomponents$httpmime/builds/2013-01-24_12-02-28/archive/org.apache.httpcomponents/httpmime/4.3-alpha2-SNAPSHOT/httpmime-4.3-alpha2-SNAPSHOT-sources.jar
[JENKINS] Archiving <https://builds.apache.org/job/HttpComponents%20Client/ws/httpclient-trunk/httpclient-cache/pom.xml>
to /home/hudson/hudson/jobs/HttpComponents Client/modules/org.apache.httpcomponents$httpclient-cache/builds/2013-01-24_12-02-28/archive/org.apache.httpcomponents/httpclient-cache/4.3-alpha2-SNAPSHOT/httpclient-cache-4.3-alpha2-SNAPSHOT.pom
Waiting for Jenkins to finish collecting data
mavenExecutionResult exceptions not empty
message : Failed to execute goal org.apache.maven.plugins:maven-compiler-plugin:2.3.2:compile
(default-compile) on project httpclient-cache: Compilation failure
<https://builds.apache.org/job/HttpComponents%20Client/ws/httpclient-trunk/httpclient-cache/src/main/java/org/apache/http/impl/client/cache/AsynchronousValidator.java>:[90,5]
method does not override a method from its superclass

cause : Compilation failure
<https://builds.apache.org/job/HttpComponents%20Client/ws/httpclient-trunk/httpclient-cache/src/main/java/org/apache/http/impl/client/cache/AsynchronousValidator.java>:[90,5]
method does not override a method from its superclass

Stack trace : 
org.apache.maven.lifecycle.LifecycleExecutionException: Failed to execute goal org.apache.maven.plugins:maven-compiler-plugin:2.3.2:compile
(default-compile) on project httpclient-cache: Compilation failure
<https://builds.apache.org/job/HttpComponents%20Client/ws/httpclient-trunk/httpclient-cache/src/main/java/org/apache/http/impl/client/cache/AsynchronousValidator.java>:[90,5]
method does not override a method from its superclass

	at org.apache.maven.lifecycle.internal.MojoExecutor.execute(MojoExecutor.java:213)
	at org.apache.maven.lifecycle.internal.MojoExecutor.execute(MojoExecutor.java:153)
	at org.apache.maven.lifecycle.internal.MojoExecutor.execute(MojoExecutor.java:145)
	at org.apache.maven.lifecycle.internal.LifecycleModuleBuilder.buildProject(LifecycleModuleBuilder.java:84)
	at org.apache.maven.lifecycle.internal.LifecycleModuleBuilder.buildProject(LifecycleModuleBuilder.java:59)
	at org.apache.maven.lifecycle.internal.LifecycleStarter.singleThreadedBuild(LifecycleStarter.java:183)
	at org.apache.maven.lifecycle.internal.LifecycleStarter.execute(LifecycleStarter.java:161)
	at org.apache.maven.DefaultMaven.doExecute(DefaultMaven.java:319)
	at org.apache.maven.DefaultMaven.execute(DefaultMaven.java:156)
	at org.jvnet.hudson.maven3.launcher.Maven3Launcher.main(Maven3Launcher.java:79)
	at sun.reflect.NativeMethodAccessorImpl.invoke0(Native Method)
	at sun.reflect.NativeMethodAccessorImpl.invoke(NativeMethodAccessorImpl.java:39)
	at sun.reflect.DelegatingMethodAccessorImpl.invoke(DelegatingMethodAccessorImpl.java:25)
	at java.lang.reflect.Method.invoke(Method.java:592)
	at org.codehaus.plexus.classworlds.launcher.Launcher.launchStandard(Launcher.java:329)
	at org.codehaus.plexus.classworlds.launcher.Launcher.launch(Launcher.java:239)
	at org.jvnet.hudson.maven3.agent.Maven3Main.launch(Maven3Main.java:158)
	at hudson.maven.Maven3Builder.call(Maven3Builder.java:100)
	at hudson.maven.Maven3Builder.call(Maven3Builder.java:66)
	at hudson.remoting.UserRequest.perform(UserRequest.java:118)
	at hudson.remoting.UserRequest.perform(UserRequest.java:48)
	at hudson.remoting.Request$2.run(Request.java:326)
	at hudson.remoting.InterceptingExecutorService$1.call(InterceptingExecutorService.java:72)
	at java.util.concurrent.FutureTask$Sync.innerRun(FutureTask.java:269)
	at java.util.concurrent.FutureTask.run(FutureTask.java:123)
	at java.util.concurrent.ThreadPoolExecutor$Worker.runTask(ThreadPoolExecutor.java:651)
	at java.util.concurrent.ThreadPoolExecutor$Worker.run(ThreadPoolExecutor.java:676)
	at java.lang.Thread.run(Thread.java:595)
Caused by: org.apache.maven.plugin.CompilationFailureException: Compilation failure
<https://builds.apache.org/job/HttpComponents%20Client/ws/httpclient-trunk/httpclient-cache/src/main/java/org/apache/http/impl/client/cache/AsynchronousValidator.java>:[90,5]
method does not override a method from its superclass

	at org.apache.maven.plugin.AbstractCompilerMojo.execute(AbstractCompilerMojo.java:656)
	at org.apache.maven.plugin.CompilerMojo.execute(CompilerMojo.java:128)
	at org.apache.maven.plugin.DefaultBuildPluginManager.executeMojo(DefaultBuildPluginManager.java:101)
	at org.apache.maven.lifecycle.internal.MojoExecutor.execute(MojoExecutor.java:209)
	... 27 more
Sending e-mails to: commits@hc.apache.org
channel stopped

Mime
View raw message