hc-commits mailing list archives

Site index · List index
Message view « Date » · « Thread »
Top « Date » · « Thread »
From Apache Jenkins Server <jenk...@builds.apache.org>
Subject Build failed in Jenkins: HttpComponents Client #458
Date Sun, 01 Jul 2012 00:47:44 GMT
See <https://builds.apache.org/job/HttpComponents%20Client/458/changes>

Changes:

[olegk] Fixed grammatical error in release notes

[olegk] Added Quick Start sources; fixed release notes header

[olegk] Updated release notes and download page for HttpClient 4.2.1 release

[olegk] HTTPCLIENT-1201: removed catch clauses for brevity

[olegk] HTTPCLIENT-1201: Quick start doc improvements
Contributed by miles zarathustra <albert.bradley at thomsonreuters.com>

[sebb] HTTPCLIENT-1195 - URIBuilder-created query strings are double-escaped
Add [ ] to reserved chars
Use separate safe sets for userinfo and fragment

[sebb] Add test to check that builder behaves the same as URI

[sebb] Change form encoded escaping to agree with previous release and browsers

[sebb] Javadoc

[sebb] Javadoc

[sebb] Javadoc

[sebb] Add tests for charset String version of parse

[sebb] Rename private methods to make their function clearer

[sebb] Simplify nested if

[olegk] HTTPCLIENT-1195: minor optimization

[sebb] Javadoc

[olegk] HTTPCLIENT-1201: Quick start doc improvements
Contributed by miles zarathustra <albert.bradley at thomsonreuters.com>

[olegk] HTTPCLIENT-1195: blanks in the query part of request URIs to be encoded as '+'

[sebb] HTTPCLIENT-1195 - URIBuilder-created query strings are double-escaped
Move normalization from URIUtils to URIBuilder so encodedPath is not dropped
Oops - don't do double normalisation

[sebb] HTTPCLIENT-1195 - URIBuilder-created query strings are double-escaped
Move normalization from URIUtils to URIBuilder so encodedPath is not dropped

[sebb] Unused import

[sebb] Javadoc

[sebb] Add String version of format test

[sebb] Eclipse says: contentType cannot be null here

[sebb] Add tests for port and scheme copy

[sebb] Javadoc

[sebb] Fix up query test cases so they are actually queries
Add extra encoded & to path tests

[sebb] HTTPCLIENT-1195 - URIBuilder-created query strings are double-escaped
Ensure escapedQuery is not unescaped - fixes failed test testEscapedSpaceInQueryAbsolute

[sebb] Restore from TestUriEscapes.java@1349668

------------------------------------------
Started by an SCM change
Building remotely on ubuntu4 in workspace <https://builds.apache.org/job/HttpComponents%20Client/ws/>
Updating http://svn.apache.org/repos/asf/httpcomponents/httpclient/trunk
U         src/site/apt/download.apt
U         src/site/apt/quickstart.apt
U         RELEASE_NOTES.txt
AU        fluent-hc/src/examples/org/apache/http/client/fluent/FluentQuickStart.java
U         httpclient/src/test/java/org/apache/http/client/utils/TestURIBuilder.java
ERROR: Failed to update http://svn.apache.org/repos/asf/httpcomponents/httpclient/trunk
org.tmatesoft.svn.core.SVNException: svn: E175002: REPORT /repos/asf/!svn/vcc/default failed
	at org.tmatesoft.svn.core.internal.io.dav.http.HTTPConnection.request(HTTPConnection.java:304)
	at org.tmatesoft.svn.core.internal.io.dav.http.HTTPConnection.request(HTTPConnection.java:289)
	at org.tmatesoft.svn.core.internal.io.dav.http.HTTPConnection.request(HTTPConnection.java:277)
	at org.tmatesoft.svn.core.internal.io.dav.DAVConnection.performHttpRequest(DAVConnection.java:696)
	at org.tmatesoft.svn.core.internal.io.dav.DAVConnection.doReport(DAVConnection.java:328)
	at org.tmatesoft.svn.core.internal.io.dav.DAVRepository.runReport(DAVRepository.java:1289)
	at org.tmatesoft.svn.core.internal.io.dav.DAVRepository.update(DAVRepository.java:837)
	at org.tmatesoft.svn.core.internal.wc16.SVNUpdateClient16.update(SVNUpdateClient16.java:557)
	at org.tmatesoft.svn.core.internal.wc16.SVNUpdateClient16.doUpdate(SVNUpdateClient16.java:414)
	at org.tmatesoft.svn.core.internal.wc16.SVNUpdateClient16.doUpdate(SVNUpdateClient16.java:324)
	at org.tmatesoft.svn.core.internal.wc2.old.SvnOldUpdate.run(SvnOldUpdate.java:27)
	at org.tmatesoft.svn.core.internal.wc2.old.SvnOldUpdate.run(SvnOldUpdate.java:11)
	at org.tmatesoft.svn.core.internal.wc2.SvnOperationRunner.run(SvnOperationRunner.java:20)
	at org.tmatesoft.svn.core.wc2.SvnOperationFactory.run(SvnOperationFactory.java:1221)
	at org.tmatesoft.svn.core.wc2.SvnOperation.run(SvnOperation.java:292)
	at org.tmatesoft.svn.core.wc.SVNUpdateClient.doUpdate(SVNUpdateClient.java:315)
	at org.tmatesoft.svn.core.wc.SVNUpdateClient.doUpdate(SVNUpdateClient.java:295)
	at org.tmatesoft.svn.core.wc.SVNUpdateClient.doUpdate(SVNUpdateClient.java:391)
	at hudson.scm.subversion.UpdateUpdater$TaskImpl.perform(UpdateUpdater.java:136)
	at hudson.scm.subversion.WorkspaceUpdater$UpdateTask.delegateTo(WorkspaceUpdater.java:144)
	at hudson.scm.SubversionSCM$CheckOutTask.perform(SubversionSCM.java:789)
	at hudson.scm.SubversionSCM$CheckOutTask.invoke(SubversionSCM.java:770)
	at hudson.scm.SubversionSCM$CheckOutTask.invoke(SubversionSCM.java:753)
	at hudson.FilePath$FileCallableWrapper.call(FilePath.java:2180)
	at hudson.remoting.UserRequest.perform(UserRequest.java:118)
	at hudson.remoting.UserRequest.perform(UserRequest.java:48)
	at hudson.remoting.Request$2.run(Request.java:287)
	at hudson.remoting.InterceptingExecutorService$1.call(InterceptingExecutorService.java:72)
	at java.util.concurrent.FutureTask$Sync.innerRun(FutureTask.java:334)
	at java.util.concurrent.FutureTask.run(FutureTask.java:166)
	at java.util.concurrent.ThreadPoolExecutor.runWorker(ThreadPoolExecutor.java:1110)
	at java.util.concurrent.ThreadPoolExecutor$Worker.run(ThreadPoolExecutor.java:603)
	at java.lang.Thread.run(Thread.java:636)
Caused by: svn: E175002: REPORT /repos/asf/!svn/vcc/default failed
	at org.tmatesoft.svn.core.SVNErrorMessage.create(SVNErrorMessage.java:208)
	at org.tmatesoft.svn.core.SVNErrorMessage.create(SVNErrorMessage.java:154)
	at org.tmatesoft.svn.core.SVNErrorMessage.create(SVNErrorMessage.java:97)
	... 33 more
Caused by: org.tmatesoft.svn.core.SVNException: svn: E155017: REPORT request failed on '/repos/asf/!svn/vcc/default'
svn: E155017: Checksum mismatch while updating '<https://builds.apache.org/job/HttpComponents%20Client/ws/httpclient-trunk/httpclient/src/test/java/org/apache/http/client/protocol/.svn/text-base/TestUriEscapes.java.svn-base';>
expected: 'b3f05cf2bbeec6db676d341ea67589f6', actual: '7078d085d28e9f1b2f0225c1e88d5d6b'
	at org.tmatesoft.svn.core.internal.wc.SVNErrorManager.error(SVNErrorManager.java:64)
	at org.tmatesoft.svn.core.internal.wc.SVNErrorManager.error(SVNErrorManager.java:51)
	at org.tmatesoft.svn.core.internal.io.dav.http.HTTPConnection._request(HTTPConnection.java:675)
	at org.tmatesoft.svn.core.internal.io.dav.http.HTTPConnection.request(HTTPConnection.java:298)
	... 32 more
Caused by: svn: E155017: REPORT request failed on '/repos/asf/!svn/vcc/default'
	at org.tmatesoft.svn.core.SVNErrorMessage.create(SVNErrorMessage.java:208)
	at org.tmatesoft.svn.core.SVNErrorMessage.create(SVNErrorMessage.java:154)
	at org.tmatesoft.svn.core.SVNErrorMessage.create(SVNErrorMessage.java:97)
	at org.tmatesoft.svn.core.SVNErrorMessage.wrap(SVNErrorMessage.java:414)
	... 34 more
Caused by: svn: E155017: Checksum mismatch while updating '<https://builds.apache.org/job/HttpComponents%20Client/ws/httpclient-trunk/httpclient/src/test/java/org/apache/http/client/protocol/.svn/text-base/TestUriEscapes.java.svn-base';>
expected: 'b3f05cf2bbeec6db676d341ea67589f6', actual: '7078d085d28e9f1b2f0225c1e88d5d6b'
	at org.tmatesoft.svn.core.SVNErrorMessage.create(SVNErrorMessage.java:208)
	at org.tmatesoft.svn.core.SVNErrorMessage.create(SVNErrorMessage.java:189)
	at org.tmatesoft.svn.core.SVNErrorMessage.create(SVNErrorMessage.java:141)
	at org.tmatesoft.svn.core.internal.wc.SVNUpdateEditor15.textDeltaEnd(SVNUpdateEditor15.java:634)
	at org.tmatesoft.svn.core.internal.wc.SVNAmbientDepthFilterEditor.textDeltaEnd(SVNAmbientDepthFilterEditor.java:221)
	at org.tmatesoft.svn.core.internal.wc.SVNCancellableEditor.textDeltaEnd(SVNCancellableEditor.java:130)
	at org.tmatesoft.svn.core.internal.io.dav.handlers.BasicDAVDeltaHandler.setDeltaProcessing(BasicDAVDeltaHandler.java:41)
	at org.tmatesoft.svn.core.internal.io.dav.handlers.DAVEditorHandler.endElement(DAVEditorHandler.java:548)
	at org.tmatesoft.svn.core.internal.io.dav.handlers.BasicDAVHandler.endElement(BasicDAVHandler.java:103)
	at org.apache.xerces.parsers.AbstractSAXParser.endElement(Unknown Source)
	at org.apache.xerces.impl.XMLNSDocumentScannerImpl.scanEndElement(Unknown Source)
	at org.apache.xerces.impl.XMLDocumentFragmentScannerImpl$FragmentContentDispatcher.dispatch(Unknown
Source)
	at org.apache.xerces.impl.XMLDocumentFragmentScannerImpl.scanDocument(Unknown Source)
	at org.apache.xerces.parsers.XML11Configuration.parse(Unknown Source)
	at org.apache.xerces.parsers.XML11Configuration.parse(Unknown Source)
	at org.apache.xerces.parsers.XMLParser.parse(Unknown Source)
	at org.apache.xerces.parsers.AbstractSAXParser.parse(Unknown Source)
	at org.apache.xerces.jaxp.SAXParserImpl$JAXPSAXParser.parse(Unknown Source)
	at org.tmatesoft.svn.core.internal.io.dav.http.HTTPConnection.readData(HTTPConnection.java:796)
	at org.tmatesoft.svn.core.internal.io.dav.http.HTTPConnection.readData(HTTPConnection.java:761)
	at org.tmatesoft.svn.core.internal.io.dav.http.HTTPRequest.dispatch(HTTPRequest.java:218)
	at org.tmatesoft.svn.core.internal.io.dav.http.HTTPConnection._request(HTTPConnection.java:385)
	... 33 more
Parsing POMs
Modules changed, recalculating dependency graph
[httpclient-trunk] $ /home/hudson/tools/java/latest1.5/bin/java -cp /home/jenkins/jenkins-slave/maven-agent.jar:/home/jenkins/jenkins-slave/classworlds.jar
hudson.maven.agent.Main /home/hudson/tools/maven/apache-maven-2.2.1 /home/jenkins/jenkins-slave/slave.jar
/home/jenkins/jenkins-slave/maven-interceptor.jar 48536 /home/jenkins/jenkins-slave/maven2.1-interceptor.jar
<===[JENKINS REMOTING CAPACITY]===>channel started
   log4j:WARN No appenders could be found for logger (org.apache.commons.beanutils.converters.BooleanConverter).
log4j:WARN Please initialize the log4j system properly.
Executing Maven:  -B -f <https://builds.apache.org/job/HttpComponents%20Client/ws/httpclient-trunk/pom.xml>
-Dmaven.repo.local=/home/jenkins/jenkins-slave/maven-repositories/0 clean install
[INFO] Scanning for projects...
[INFO] Reactor build order: 
[INFO]   HttpComponents Client
[INFO]   HttpClient
[INFO]   HttpMime
[INFO]   HttpClient Cache
[INFO]   Fluent HttpClient
[INFO]   HttpClient OSGi bundle
[WARNING] POM for 'biz.aQute:bndlib:pom:1.15.0:compile' is invalid.

Its dependencies (if any) will NOT be available to the current build.
[INFO] ------------------------------------------------------------------------
[INFO] Building HttpComponents Client
[INFO]    task-segment: [clean, install]
[INFO] ------------------------------------------------------------------------
[INFO] [clean:clean {execution: default-clean}]
[INFO] Deleting <https://builds.apache.org/job/HttpComponents%20Client/ws/httpclient-trunk/target>
[INFO] [buildnumber:create {execution: default}]
[INFO] Change the default 'svn' provider implementation to 'javasvn'.
[INFO] Checking for local modifications: skipped.
[INFO] Updating project files from SCM: skipped.
[INFO] Storing buildNumber: 1353122 at timestamp: 1341103641754
[INFO] Storing buildScmBranch: trunk
[INFO] [notice:generate {execution: attach-notice-license}]
[INFO] [site:attach-descriptor {execution: default-attach-descriptor}]
[INFO] Preparing source:jar
[WARNING] Removing: jar from forked lifecycle, to prevent recursive invocation.
[JENKINS] Archiving <https://builds.apache.org/job/HttpComponents%20Client/ws/httpclient-trunk/pom.xml>
to /home/hudson/hudson/jobs/HttpComponents Client/modules/org.apache.httpcomponents$httpcomponents-client/builds/2012-07-01_00-46-41/archive/org.apache.httpcomponents/httpcomponents-client/4.2.1-SNAPSHOT/httpcomponents-client-4.2.1-SNAPSHOT.pom
[JENKINS] Archiving <https://builds.apache.org/job/HttpComponents%20Client/ws/httpclient-trunk/target/httpcomponents-client-4.2.1-SNAPSHOT-site.xml>
to /home/hudson/hudson/jobs/HttpComponents Client/modules/org.apache.httpcomponents$httpcomponents-client/builds/2012-07-01_00-46-41/archive/org.apache.httpcomponents/httpcomponents-client/4.2.1-SNAPSHOT/httpcomponents-client-4.2.1-SNAPSHOT-site.xml
[INFO] [buildnumber:create {execution: default}]
[INFO] Change the default 'svn' provider implementation to 'javasvn'.
[INFO] Checking for local modifications: skipped.
[INFO] Updating project files from SCM: skipped.
[INFO] Storing buildNumber: 1353122 at timestamp: 1341103649579
[INFO] Storing buildScmBranch: trunk
[INFO] [source:jar {execution: attach-sources}]
[INFO] [install:install {execution: default-install}]
[INFO] Installing <https://builds.apache.org/job/HttpComponents%20Client/ws/httpclient-trunk/pom.xml>
to /home/jenkins/jenkins-slave/maven-repositories/0/org/apache/httpcomponents/httpcomponents-client/4.2.1-SNAPSHOT/httpcomponents-client-4.2.1-SNAPSHOT.pom
[INFO] Installing <https://builds.apache.org/job/HttpComponents%20Client/ws/httpclient-trunk/target/httpcomponents-client-4.2.1-SNAPSHOT-site.xml>
to /home/jenkins/jenkins-slave/maven-repositories/0/org/apache/httpcomponents/httpcomponents-client/4.2.1-SNAPSHOT/httpcomponents-client-4.2.1-SNAPSHOT-site.xml
[INFO] ------------------------------------------------------------------------
[INFO] Building HttpClient
[INFO]    task-segment: [clean, install]
[INFO] ------------------------------------------------------------------------
[INFO] [clean:clean {execution: default-clean}]
[INFO] Deleting <https://builds.apache.org/job/HttpComponents%20Client/ws/httpclient-trunk/httpclient/target>
[INFO] [buildnumber:create {execution: default}]
[INFO] Change the default 'svn' provider implementation to 'javasvn'.
[INFO] Checking for local modifications: skipped.
[INFO] Updating project files from SCM: skipped.
[INFO] Storing buildNumber: 1353122 at timestamp: 1341103653068
[INFO] Storing buildScmBranch: trunk
[INFO] [notice:generate {execution: attach-notice-license}]
[INFO] Generating NOTICE and LICENSE resources
[debug] execute contextualize
[INFO] [resources:resources {execution: default-resources}]
[INFO] Using 'UTF-8' encoding to copy filtered resources.
[INFO] Copying 1 resource
[INFO] Copying 2 resources to META-INF
[INFO] [compiler:compile {execution: default-compile}]
[INFO] Compiling 291 source files to <https://builds.apache.org/job/HttpComponents%20Client/ws/httpclient-trunk/httpclient/target/classes>
[debug] execute contextualize
[INFO] [resources:testResources {execution: default-testResources}]
[INFO] Using 'UTF-8' encoding to copy filtered resources.
[INFO] Copying 3 resources
[INFO] Copying 2 resources to META-INF
[INFO] [compiler:testCompile {execution: default-testCompile}]
[INFO] Compiling 114 source files to <https://builds.apache.org/job/HttpComponents%20Client/ws/httpclient-trunk/httpclient/target/test-classes>
[INFO] -------------------------------------------------------------
[ERROR] COMPILATION ERROR : 
[INFO] -------------------------------------------------------------
[ERROR] <https://builds.apache.org/job/HttpComponents%20Client/ws/httpclient-trunk/httpclient/src/test/java/org/apache/http/client/protocol/TestUriEscapes.java>:[192,0]
'class' or 'interface' expected
[ERROR] <https://builds.apache.org/job/HttpComponents%20Client/ws/httpclient-trunk/httpclient/src/test/java/org/apache/http/client/protocol/TestUriEscapes.java>:[194,0]
'class' or 'interface' expected
[ERROR] <https://builds.apache.org/job/HttpComponents%20Client/ws/httpclient-trunk/httpclient/src/test/java/org/apache/http/client/protocol/TestUriEscapes.java>:[195,0]
'class' or 'interface' expected
[ERROR] <https://builds.apache.org/job/HttpComponents%20Client/ws/httpclient-trunk/httpclient/src/test/java/org/apache/http/client/protocol/TestUriEscapes.java>:[197,0]
'class' or 'interface' expected
[ERROR] <https://builds.apache.org/job/HttpComponents%20Client/ws/httpclient-trunk/httpclient/src/test/java/org/apache/http/client/protocol/TestUriEscapes.java>:[198,0]
'class' or 'interface' expected
[ERROR] <https://builds.apache.org/job/HttpComponents%20Client/ws/httpclient-trunk/httpclient/src/test/java/org/apache/http/client/protocol/TestUriEscapes.java>:[199,0]
'class' or 'interface' expected
[ERROR] <https://builds.apache.org/job/HttpComponents%20Client/ws/httpclient-trunk/httpclient/src/test/java/org/apache/http/client/protocol/TestUriEscapes.java>:[200,0]
'class' or 'interface' expected
[ERROR] <https://builds.apache.org/job/HttpComponents%20Client/ws/httpclient-trunk/httpclient/src/test/java/org/apache/http/client/protocol/TestUriEscapes.java>:[201,0]
'class' or 'interface' expected
[ERROR] <https://builds.apache.org/job/HttpComponents%20Client/ws/httpclient-trunk/httpclient/src/test/java/org/apache/http/client/protocol/TestUriEscapes.java>:[202,0]
'class' or 'interface' expected
[ERROR] <https://builds.apache.org/job/HttpComponents%20Client/ws/httpclient-trunk/httpclient/src/test/java/org/apache/http/client/protocol/TestUriEscapes.java>:[203,0]
'class' or 'interface' expected
[ERROR] <https://builds.apache.org/job/HttpComponents%20Client/ws/httpclient-trunk/httpclient/src/test/java/org/apache/http/client/protocol/TestUriEscapes.java>:[204,0]
'class' or 'interface' expected
[ERROR] <https://builds.apache.org/job/HttpComponents%20Client/ws/httpclient-trunk/httpclient/src/test/java/org/apache/http/client/protocol/TestUriEscapes.java>:[205,0]
'class' or 'interface' expected
[ERROR] <https://builds.apache.org/job/HttpComponents%20Client/ws/httpclient-trunk/httpclient/src/test/java/org/apache/http/client/protocol/TestUriEscapes.java>:[206,0]
'class' or 'interface' expected
[ERROR] <https://builds.apache.org/job/HttpComponents%20Client/ws/httpclient-trunk/httpclient/src/test/java/org/apache/http/client/protocol/TestUriEscapes.java>:[207,0]
'class' or 'interface' expected
[ERROR] <https://builds.apache.org/job/HttpComponents%20Client/ws/httpclient-trunk/httpclient/src/test/java/org/apache/http/client/protocol/TestUriEscapes.java>:[208,0]
'class' or 'interface' expected
[ERROR] <https://builds.apache.org/job/HttpComponents%20Client/ws/httpclient-trunk/httpclient/src/test/java/org/apache/http/client/protocol/TestUriEscapes.java>:[209,0]
'class' or 'interface' expected
[ERROR] <https://builds.apache.org/job/HttpComponents%20Client/ws/httpclient-trunk/httpclient/src/test/java/org/apache/http/client/protocol/TestUriEscapes.java>:[210,0]
'class' or 'interface' expected
[ERROR] <https://builds.apache.org/job/HttpComponents%20Client/ws/httpclient-trunk/httpclient/src/test/java/org/apache/http/client/protocol/TestUriEscapes.java>:[211,0]
'class' or 'interface' expected
[ERROR] <https://builds.apache.org/job/HttpComponents%20Client/ws/httpclient-trunk/httpclient/src/test/java/org/apache/http/client/protocol/TestUriEscapes.java>:[212,0]
'class' or 'interface' expected
[ERROR] <https://builds.apache.org/job/HttpComponents%20Client/ws/httpclient-trunk/httpclient/src/test/java/org/apache/http/client/protocol/TestUriEscapes.java>:[213,0]
'class' or 'interface' expected
[INFO] 20 errors 
[INFO] -------------------------------------------------------------
[JENKINS] Archiving <https://builds.apache.org/job/HttpComponents%20Client/ws/httpclient-trunk/httpclient/pom.xml>
to /home/hudson/hudson/jobs/HttpComponents Client/modules/org.apache.httpcomponents$httpclient/builds/2012-07-01_00-46-41/archive/org.apache.httpcomponents/httpclient/4.2.1-SNAPSHOT/httpclient-4.2.1-SNAPSHOT.pom
[INFO] ------------------------------------------------------------------------
[ERROR] BUILD FAILURE
[INFO] ------------------------------------------------------------------------
[INFO] Compilation failure

<https://builds.apache.org/job/HttpComponents%20Client/ws/httpclient-trunk/httpclient/src/test/java/org/apache/http/client/protocol/TestUriEscapes.java>:[192,0]
'class' or 'interface' expected
<https://builds.apache.org/job/HttpComponents%20Client/ws/httpclient-trunk/httpclient/src/test/java/org/apache/http/client/protocol/TestUriEscapes.java>:[194,0]
'class' or 'interface' expected
<https://builds.apache.org/job/HttpComponents%20Client/ws/httpclient-trunk/httpclient/src/test/java/org/apache/http/client/protocol/TestUriEscapes.java>:[195,0]
'class' or 'interface' expected
<https://builds.apache.org/job/HttpComponents%20Client/ws/httpclient-trunk/httpclient/src/test/java/org/apache/http/client/protocol/TestUriEscapes.java>:[197,0]
'class' or 'interface' expected
<https://builds.apache.org/job/HttpComponents%20Client/ws/httpclient-trunk/httpclient/src/test/java/org/apache/http/client/protocol/TestUriEscapes.java>:[198,0]
'class' or 'interface' expected
<https://builds.apache.org/job/HttpComponents%20Client/ws/httpclient-trunk/httpclient/src/test/java/org/apache/http/client/protocol/TestUriEscapes.java>:[199,0]
'class' or 'interface' expected
<https://builds.apache.org/job/HttpComponents%20Client/ws/httpclient-trunk/httpclient/src/test/java/org/apache/http/client/protocol/TestUriEscapes.java>:[200,0]
'class' or 'interface' expected
<https://builds.apache.org/job/HttpComponents%20Client/ws/httpclient-trunk/httpclient/src/test/java/org/apache/http/client/protocol/TestUriEscapes.java>:[201,0]
'class' or 'interface' expected
<https://builds.apache.org/job/HttpComponents%20Client/ws/httpclient-trunk/httpclient/src/test/java/org/apache/http/client/protocol/TestUriEscapes.java>:[202,0]
'class' or 'interface' expected
<https://builds.apache.org/job/HttpComponents%20Client/ws/httpclient-trunk/httpclient/src/test/java/org/apache/http/client/protocol/TestUriEscapes.java>:[203,0]
'class' or 'interface' expected
<https://builds.apache.org/job/HttpComponents%20Client/ws/httpclient-trunk/httpclient/src/test/java/org/apache/http/client/protocol/TestUriEscapes.java>:[204,0]
'class' or 'interface' expected
<https://builds.apache.org/job/HttpComponents%20Client/ws/httpclient-trunk/httpclient/src/test/java/org/apache/http/client/protocol/TestUriEscapes.java>:[205,0]
'class' or 'interface' expected
<https://builds.apache.org/job/HttpComponents%20Client/ws/httpclient-trunk/httpclient/src/test/java/org/apache/http/client/protocol/TestUriEscapes.java>:[206,0]
'class' or 'interface' expected
<https://builds.apache.org/job/HttpComponents%20Client/ws/httpclient-trunk/httpclient/src/test/java/org/apache/http/client/protocol/TestUriEscapes.java>:[207,0]
'class' or 'interface' expected
<https://builds.apache.org/job/HttpComponents%20Client/ws/httpclient-trunk/httpclient/src/test/java/org/apache/http/client/protocol/TestUriEscapes.java>:[208,0]
'class' or 'interface' expected
<https://builds.apache.org/job/HttpComponents%20Client/ws/httpclient-trunk/httpclient/src/test/java/org/apache/http/client/protocol/TestUriEscapes.java>:[209,0]
'class' or 'interface' expected
<https://builds.apache.org/job/HttpComponents%20Client/ws/httpclient-trunk/httpclient/src/test/java/org/apache/http/client/protocol/TestUriEscapes.java>:[210,0]
'class' or 'interface' expected
<https://builds.apache.org/job/HttpComponents%20Client/ws/httpclient-trunk/httpclient/src/test/java/org/apache/http/client/protocol/TestUriEscapes.java>:[211,0]
'class' or 'interface' expected
<https://builds.apache.org/job/HttpComponents%20Client/ws/httpclient-trunk/httpclient/src/test/java/org/apache/http/client/protocol/TestUriEscapes.java>:[212,0]
'class' or 'interface' expected
<https://builds.apache.org/job/HttpComponents%20Client/ws/httpclient-trunk/httpclient/src/test/java/org/apache/http/client/protocol/TestUriEscapes.java>:[213,0]
'class' or 'interface' expected

[INFO] ------------------------------------------------------------------------
[INFO] For more information, run Maven with the -e switch
[INFO] ------------------------------------------------------------------------
[INFO] Total time: 36 seconds
[INFO] Finished at: Sun Jul 01 00:47:42 UTC 2012
[INFO] Final Memory: 61M/312M
[INFO] ------------------------------------------------------------------------
channel stopped

Mime
View raw message