hc-commits mailing list archives

Site index · List index
Message view « Date » · « Thread »
Top « Date » · « Thread »
From Apache Jenkins Server <jenk...@builds.apache.org>
Subject Build failed in Jenkins: HttpComponents Client #449
Date Sun, 24 Jun 2012 00:20:08 GMT
See <https://builds.apache.org/job/HttpComponents%20Client/449/changes>

Changes:

[sebb] Restore from TestUriEscapes.java@1349668

------------------------------------------
Started by an SCM change
Building remotely on ubuntu4 in workspace <https://builds.apache.org/job/HttpComponents%20Client/ws/>
Updating http://svn.apache.org/repos/asf/httpcomponents/httpclient/trunk
U         pom.xml
U         RELEASE_NOTES.txt
U         httpclient/src/test/java/org/apache/http/impl/client/TestDefaultRedirectStrategy.java
U         httpclient/src/test/java/org/apache/http/client/utils/TestURIUtils.java
AU        httpclient/src/test/java/org/apache/http/client/protocol/TestUriEscapes.java
U         httpclient/src/main/java/org/apache/http/impl/client/DefaultRedirectStrategy.java
U         httpclient/src/main/java/org/apache/http/client/utils/URIUtils.java
U         httpclient/src/main/java/org/apache/http/client/methods/HttpRequestBase.java
At revision 1353213
Parsing POMs
[httpclient-trunk] $ /home/hudson/tools/java/latest1.5/bin/java -cp /home/jenkins/jenkins-slave/maven-agent.jar:/home/jenkins/jenkins-slave/classworlds.jar
hudson.maven.agent.Main /home/hudson/tools/maven/apache-maven-2.2.1 /home/jenkins/jenkins-slave/slave.jar
/home/jenkins/jenkins-slave/maven-interceptor.jar 34172 /home/jenkins/jenkins-slave/maven2.1-interceptor.jar
<===[JENKINS REMOTING CAPACITY]===>channel started
   log4j:WARN No appenders could be found for logger (org.apache.commons.beanutils.converters.BooleanConverter).
log4j:WARN Please initialize the log4j system properly.
Executing Maven:  -B -f <https://builds.apache.org/job/HttpComponents%20Client/ws/httpclient-trunk/pom.xml>
-Dmaven.repo.local=/home/jenkins/jenkins-slave/maven-repositories/1 clean install
[INFO] Scanning for projects...
[INFO] Reactor build order: 
[INFO]   HttpComponents Client
[INFO]   HttpClient
[INFO]   HttpMime
[INFO]   HttpClient Cache
[INFO]   Fluent HttpClient
[INFO]   HttpClient OSGi bundle
[WARNING] POM for 'biz.aQute:bndlib:pom:1.15.0:compile' is invalid.

Its dependencies (if any) will NOT be available to the current build.
[INFO] ------------------------------------------------------------------------
[INFO] Building HttpComponents Client
[INFO]    task-segment: [clean, install]
[INFO] ------------------------------------------------------------------------
[INFO] [clean:clean {execution: default-clean}]
[INFO] Deleting <https://builds.apache.org/job/HttpComponents%20Client/ws/httpclient-trunk/target>
[INFO] [buildnumber:create {execution: default}]
[INFO] Change the default 'svn' provider implementation to 'javasvn'.
[INFO] Checking for local modifications: skipped.
[INFO] Updating project files from SCM: skipped.
[INFO] Storing buildNumber: 1353122 at timestamp: 1340497192396
[INFO] Storing buildScmBranch: trunk
[INFO] [notice:generate {execution: attach-notice-license}]
[INFO] [site:attach-descriptor {execution: default-attach-descriptor}]
[INFO] Preparing source:jar
[WARNING] Removing: jar from forked lifecycle, to prevent recursive invocation.
[JENKINS] Archiving <https://builds.apache.org/job/HttpComponents%20Client/ws/httpclient-trunk/pom.xml>
to /home/hudson/hudson/jobs/HttpComponents Client/modules/org.apache.httpcomponents$httpcomponents-client/builds/2012-06-24_00-19-19/archive/org.apache.httpcomponents/httpcomponents-client/4.2.1-SNAPSHOT/httpcomponents-client-4.2.1-SNAPSHOT.pom
[JENKINS] Archiving <https://builds.apache.org/job/HttpComponents%20Client/ws/httpclient-trunk/target/httpcomponents-client-4.2.1-SNAPSHOT-site.xml>
to /home/hudson/hudson/jobs/HttpComponents Client/modules/org.apache.httpcomponents$httpcomponents-client/builds/2012-06-24_00-19-19/archive/org.apache.httpcomponents/httpcomponents-client/4.2.1-SNAPSHOT/httpcomponents-client-4.2.1-SNAPSHOT-site.xml
[INFO] [buildnumber:create {execution: default}]
[INFO] Change the default 'svn' provider implementation to 'javasvn'.
[INFO] Checking for local modifications: skipped.
[INFO] Updating project files from SCM: skipped.
[INFO] Storing buildNumber: 1353122 at timestamp: 1340497198147
[INFO] Storing buildScmBranch: trunk
[INFO] [source:jar {execution: attach-sources}]
[INFO] [install:install {execution: default-install}]
[INFO] Installing <https://builds.apache.org/job/HttpComponents%20Client/ws/httpclient-trunk/pom.xml>
to /home/jenkins/jenkins-slave/maven-repositories/1/org/apache/httpcomponents/httpcomponents-client/4.2.1-SNAPSHOT/httpcomponents-client-4.2.1-SNAPSHOT.pom
[INFO] Installing <https://builds.apache.org/job/HttpComponents%20Client/ws/httpclient-trunk/target/httpcomponents-client-4.2.1-SNAPSHOT-site.xml>
to /home/jenkins/jenkins-slave/maven-repositories/1/org/apache/httpcomponents/httpcomponents-client/4.2.1-SNAPSHOT/httpcomponents-client-4.2.1-SNAPSHOT-site.xml
[INFO] ------------------------------------------------------------------------
[INFO] Building HttpClient
[INFO]    task-segment: [clean, install]
[INFO] ------------------------------------------------------------------------
[INFO] [clean:clean {execution: default-clean}]
[INFO] Deleting <https://builds.apache.org/job/HttpComponents%20Client/ws/httpclient-trunk/httpclient/target>
[INFO] [buildnumber:create {execution: default}]
[INFO] Change the default 'svn' provider implementation to 'javasvn'.
[INFO] Checking for local modifications: skipped.
[INFO] Updating project files from SCM: skipped.
[INFO] Storing buildNumber: 1353122 at timestamp: 1340497200626
[INFO] Storing buildScmBranch: trunk
[INFO] [notice:generate {execution: attach-notice-license}]
[INFO] Generating NOTICE and LICENSE resources
[debug] execute contextualize
[INFO] [resources:resources {execution: default-resources}]
[INFO] Using 'UTF-8' encoding to copy filtered resources.
[INFO] Copying 1 resource
[INFO] Copying 2 resources to META-INF
Downloading: http://files.couchbase.com/maven2//org/apache/httpcomponents/httpcore/4.2.1/httpcore-4.2.1.jar
[INFO] Unable to find resource 'org.apache.httpcomponents:httpcore:jar:4.2.1' in repository
spy (http://files.couchbase.com/maven2/)
Downloading: http://repo1.maven.org/maven2/org/apache/httpcomponents/httpcore/4.2.1/httpcore-4.2.1.jar

[INFO] [compiler:compile {execution: default-compile}]
[INFO] Compiling 291 source files to <https://builds.apache.org/job/HttpComponents%20Client/ws/httpclient-trunk/httpclient/target/classes>
[debug] execute contextualize
[INFO] [resources:testResources {execution: default-testResources}]
[INFO] Using 'UTF-8' encoding to copy filtered resources.
[INFO] Copying 3 resources
[INFO] Copying 2 resources to META-INF
[INFO] [compiler:testCompile {execution: default-testCompile}]
[INFO] Compiling 114 source files to <https://builds.apache.org/job/HttpComponents%20Client/ws/httpclient-trunk/httpclient/target/test-classes>
[INFO] -------------------------------------------------------------
[ERROR] COMPILATION ERROR : 
[INFO] -------------------------------------------------------------
[ERROR] <https://builds.apache.org/job/HttpComponents%20Client/ws/httpclient-trunk/httpclient/src/test/java/org/apache/http/client/protocol/TestUriEscapes.java>:[192,0]
'class' or 'interface' expected
[ERROR] <https://builds.apache.org/job/HttpComponents%20Client/ws/httpclient-trunk/httpclient/src/test/java/org/apache/http/client/protocol/TestUriEscapes.java>:[194,0]
'class' or 'interface' expected
[ERROR] <https://builds.apache.org/job/HttpComponents%20Client/ws/httpclient-trunk/httpclient/src/test/java/org/apache/http/client/protocol/TestUriEscapes.java>:[195,0]
'class' or 'interface' expected
[ERROR] <https://builds.apache.org/job/HttpComponents%20Client/ws/httpclient-trunk/httpclient/src/test/java/org/apache/http/client/protocol/TestUriEscapes.java>:[197,0]
'class' or 'interface' expected
[ERROR] <https://builds.apache.org/job/HttpComponents%20Client/ws/httpclient-trunk/httpclient/src/test/java/org/apache/http/client/protocol/TestUriEscapes.java>:[198,0]
'class' or 'interface' expected
[ERROR] <https://builds.apache.org/job/HttpComponents%20Client/ws/httpclient-trunk/httpclient/src/test/java/org/apache/http/client/protocol/TestUriEscapes.java>:[199,0]
'class' or 'interface' expected
[ERROR] <https://builds.apache.org/job/HttpComponents%20Client/ws/httpclient-trunk/httpclient/src/test/java/org/apache/http/client/protocol/TestUriEscapes.java>:[200,0]
'class' or 'interface' expected
[ERROR] <https://builds.apache.org/job/HttpComponents%20Client/ws/httpclient-trunk/httpclient/src/test/java/org/apache/http/client/protocol/TestUriEscapes.java>:[201,0]
'class' or 'interface' expected
[ERROR] <https://builds.apache.org/job/HttpComponents%20Client/ws/httpclient-trunk/httpclient/src/test/java/org/apache/http/client/protocol/TestUriEscapes.java>:[202,0]
'class' or 'interface' expected
[ERROR] <https://builds.apache.org/job/HttpComponents%20Client/ws/httpclient-trunk/httpclient/src/test/java/org/apache/http/client/protocol/TestUriEscapes.java>:[203,0]
'class' or 'interface' expected
[ERROR] <https://builds.apache.org/job/HttpComponents%20Client/ws/httpclient-trunk/httpclient/src/test/java/org/apache/http/client/protocol/TestUriEscapes.java>:[204,0]
'class' or 'interface' expected
[ERROR] <https://builds.apache.org/job/HttpComponents%20Client/ws/httpclient-trunk/httpclient/src/test/java/org/apache/http/client/protocol/TestUriEscapes.java>:[205,0]
'class' or 'interface' expected
[ERROR] <https://builds.apache.org/job/HttpComponents%20Client/ws/httpclient-trunk/httpclient/src/test/java/org/apache/http/client/protocol/TestUriEscapes.java>:[206,0]
'class' or 'interface' expected
[ERROR] <https://builds.apache.org/job/HttpComponents%20Client/ws/httpclient-trunk/httpclient/src/test/java/org/apache/http/client/protocol/TestUriEscapes.java>:[207,0]
'class' or 'interface' expected
[ERROR] <https://builds.apache.org/job/HttpComponents%20Client/ws/httpclient-trunk/httpclient/src/test/java/org/apache/http/client/protocol/TestUriEscapes.java>:[208,0]
'class' or 'interface' expected
[ERROR] <https://builds.apache.org/job/HttpComponents%20Client/ws/httpclient-trunk/httpclient/src/test/java/org/apache/http/client/protocol/TestUriEscapes.java>:[209,0]
'class' or 'interface' expected
[ERROR] <https://builds.apache.org/job/HttpComponents%20Client/ws/httpclient-trunk/httpclient/src/test/java/org/apache/http/client/protocol/TestUriEscapes.java>:[210,0]
'class' or 'interface' expected
[ERROR] <https://builds.apache.org/job/HttpComponents%20Client/ws/httpclient-trunk/httpclient/src/test/java/org/apache/http/client/protocol/TestUriEscapes.java>:[211,0]
'class' or 'interface' expected
[ERROR] <https://builds.apache.org/job/HttpComponents%20Client/ws/httpclient-trunk/httpclient/src/test/java/org/apache/http/client/protocol/TestUriEscapes.java>:[212,0]
'class' or 'interface' expected
[ERROR] <https://builds.apache.org/job/HttpComponents%20Client/ws/httpclient-trunk/httpclient/src/test/java/org/apache/http/client/protocol/TestUriEscapes.java>:[213,0]
'class' or 'interface' expected
[INFO] 20 errors 
[INFO] -------------------------------------------------------------
[JENKINS] Archiving <https://builds.apache.org/job/HttpComponents%20Client/ws/httpclient-trunk/httpclient/pom.xml>
to /home/hudson/hudson/jobs/HttpComponents Client/modules/org.apache.httpcomponents$httpclient/builds/2012-06-24_00-19-19/archive/org.apache.httpcomponents/httpclient/4.2.1-SNAPSHOT/httpclient-4.2.1-SNAPSHOT.pom
[INFO] ------------------------------------------------------------------------
[ERROR] BUILD FAILURE
[INFO] ------------------------------------------------------------------------
[INFO] Compilation failure

<https://builds.apache.org/job/HttpComponents%20Client/ws/httpclient-trunk/httpclient/src/test/java/org/apache/http/client/protocol/TestUriEscapes.java>:[192,0]
'class' or 'interface' expected
<https://builds.apache.org/job/HttpComponents%20Client/ws/httpclient-trunk/httpclient/src/test/java/org/apache/http/client/protocol/TestUriEscapes.java>:[194,0]
'class' or 'interface' expected
<https://builds.apache.org/job/HttpComponents%20Client/ws/httpclient-trunk/httpclient/src/test/java/org/apache/http/client/protocol/TestUriEscapes.java>:[195,0]
'class' or 'interface' expected
<https://builds.apache.org/job/HttpComponents%20Client/ws/httpclient-trunk/httpclient/src/test/java/org/apache/http/client/protocol/TestUriEscapes.java>:[197,0]
'class' or 'interface' expected
<https://builds.apache.org/job/HttpComponents%20Client/ws/httpclient-trunk/httpclient/src/test/java/org/apache/http/client/protocol/TestUriEscapes.java>:[198,0]
'class' or 'interface' expected
<https://builds.apache.org/job/HttpComponents%20Client/ws/httpclient-trunk/httpclient/src/test/java/org/apache/http/client/protocol/TestUriEscapes.java>:[199,0]
'class' or 'interface' expected
<https://builds.apache.org/job/HttpComponents%20Client/ws/httpclient-trunk/httpclient/src/test/java/org/apache/http/client/protocol/TestUriEscapes.java>:[200,0]
'class' or 'interface' expected
<https://builds.apache.org/job/HttpComponents%20Client/ws/httpclient-trunk/httpclient/src/test/java/org/apache/http/client/protocol/TestUriEscapes.java>:[201,0]
'class' or 'interface' expected
<https://builds.apache.org/job/HttpComponents%20Client/ws/httpclient-trunk/httpclient/src/test/java/org/apache/http/client/protocol/TestUriEscapes.java>:[202,0]
'class' or 'interface' expected
<https://builds.apache.org/job/HttpComponents%20Client/ws/httpclient-trunk/httpclient/src/test/java/org/apache/http/client/protocol/TestUriEscapes.java>:[203,0]
'class' or 'interface' expected
<https://builds.apache.org/job/HttpComponents%20Client/ws/httpclient-trunk/httpclient/src/test/java/org/apache/http/client/protocol/TestUriEscapes.java>:[204,0]
'class' or 'interface' expected
<https://builds.apache.org/job/HttpComponents%20Client/ws/httpclient-trunk/httpclient/src/test/java/org/apache/http/client/protocol/TestUriEscapes.java>:[205,0]
'class' or 'interface' expected
<https://builds.apache.org/job/HttpComponents%20Client/ws/httpclient-trunk/httpclient/src/test/java/org/apache/http/client/protocol/TestUriEscapes.java>:[206,0]
'class' or 'interface' expected
<https://builds.apache.org/job/HttpComponents%20Client/ws/httpclient-trunk/httpclient/src/test/java/org/apache/http/client/protocol/TestUriEscapes.java>:[207,0]
'class' or 'interface' expected
<https://builds.apache.org/job/HttpComponents%20Client/ws/httpclient-trunk/httpclient/src/test/java/org/apache/http/client/protocol/TestUriEscapes.java>:[208,0]
'class' or 'interface' expected
<https://builds.apache.org/job/HttpComponents%20Client/ws/httpclient-trunk/httpclient/src/test/java/org/apache/http/client/protocol/TestUriEscapes.java>:[209,0]
'class' or 'interface' expected
<https://builds.apache.org/job/HttpComponents%20Client/ws/httpclient-trunk/httpclient/src/test/java/org/apache/http/client/protocol/TestUriEscapes.java>:[210,0]
'class' or 'interface' expected
<https://builds.apache.org/job/HttpComponents%20Client/ws/httpclient-trunk/httpclient/src/test/java/org/apache/http/client/protocol/TestUriEscapes.java>:[211,0]
'class' or 'interface' expected
<https://builds.apache.org/job/HttpComponents%20Client/ws/httpclient-trunk/httpclient/src/test/java/org/apache/http/client/protocol/TestUriEscapes.java>:[212,0]
'class' or 'interface' expected
<https://builds.apache.org/job/HttpComponents%20Client/ws/httpclient-trunk/httpclient/src/test/java/org/apache/http/client/protocol/TestUriEscapes.java>:[213,0]
'class' or 'interface' expected

[INFO] ------------------------------------------------------------------------
[INFO] For more information, run Maven with the -e switch
[INFO] ------------------------------------------------------------------------
[INFO] Total time: 25 seconds
[INFO] Finished at: Sun Jun 24 00:20:07 UTC 2012
[INFO] Final Memory: 61M/313M
[INFO] ------------------------------------------------------------------------
channel stopped

Mime
View raw message