hc-commits mailing list archives

Site index · List index
Message view « Date » · « Thread »
Top « Date » · « Thread »
From Apache Jenkins Server <jenk...@builds.apache.org>
Subject Build failed in Jenkins: HttpComponents Client » HttpClient OSGi bundle #343
Date Tue, 23 Aug 2011 12:11:43 GMT
See <https://builds.apache.org/job/HttpComponents%20Client/org.apache.httpcomponents$httpclient-osgi/343/>

------------------------------------------
[INFO] ------------------------------------------------------------------------
[INFO] Building HttpClient OSGi bundle
[INFO]    task-segment: [clean, install]
[INFO] ------------------------------------------------------------------------
[INFO] [clean:clean {execution: default-clean}]
[INFO] Deleting <https://builds.apache.org/job/HttpComponents%20Client/org.apache.httpcomponents$httpclient-osgi/ws/target>
[INFO] [notice:generate {execution: attach-notice-license}]
[INFO] Generating NOTICE and LICENSE resources
[INFO] [resources:resources {execution: default-resources}]
[INFO] Using 'UTF-8' encoding to copy filtered resources.
[INFO] skip non existing resourceDirectory <https://builds.apache.org/job/HttpComponents%20Client/org.apache.httpcomponents$httpclient-osgi/ws/src/main/resources>
[INFO] Copying 2 resources to META-INF
[INFO] [compiler:compile {execution: default-compile}]
[INFO] No sources to compile
[INFO] [resources:testResources {execution: default-testResources}]
[INFO] Using 'UTF-8' encoding to copy filtered resources.
[INFO] skip non existing resourceDirectory <https://builds.apache.org/job/HttpComponents%20Client/org.apache.httpcomponents$httpclient-osgi/ws/src/test/resources>
[INFO] Copying 2 resources to META-INF
[INFO] [compiler:testCompile {execution: default-testCompile}]
[INFO] No sources to compile
[INFO] [surefire:test {execution: default-test}]
[INFO] Surefire report directory: <https://builds.apache.org/job/HttpComponents%20Client/org.apache.httpcomponents$httpclient-osgi/ws/target/surefire-reports>

-------------------------------------------------------
 T E S T S
-------------------------------------------------------
There are no tests to run.

Results :

Tests run: 0, Failures: 0, Errors: 0, Skipped: 0

[JENKINS] Recording test results
[INFO] [bundle:bundle {execution: default-bundle}]
[ERROR] Error building bundle org.apache.httpcomponents:httpclient-osgi:bundle:4.2-alpha1-SNAPSHOT
: Unresolved references to [org.apache.http.pool] by class(es) on the Bundle-Classpath[Jar:dot]:
[org/apache/http/impl/conn/HttpConnPool.class, org/apache/http/impl/conn/HttpPoolEntry.class,
org/apache/http/impl/conn/PoolingClientConnectionManager.class]
[ERROR] Error(s) found in bundle configuration
[JENKINS] Archiving <https://builds.apache.org/job/HttpComponents%20Client/org.apache.httpcomponents$httpclient-osgi/ws/pom.xml>
to /home/hudson/hudson/jobs/HttpComponents Client/modules/org.apache.httpcomponents$httpclient-osgi/builds/2011-08-23_12-00-52/archive/org.apache.httpcomponents/httpclient-osgi/4.2-alpha1-SNAPSHOT/httpclient-osgi-4.2-alpha1-SNAPSHOT.pom
[INFO] ------------------------------------------------------------------------
[ERROR] BUILD ERROR
[INFO] ------------------------------------------------------------------------
[INFO] Error(s) found in bundle configuration
[INFO] ------------------------------------------------------------------------
[INFO] For more information, run Maven with the -e switch
[INFO] ------------------------------------------------------------------------
[INFO] Total time: 7 minutes 45 seconds
[INFO] Finished at: Tue Aug 23 12:14:31 GMT+00:00 2011
[INFO] Final Memory: 54M/216M
[INFO] ------------------------------------------------------------------------


Mime
View raw message