hc-commits mailing list archives

Site index · List index
Message view « Date » · « Thread »
Top « Date » · « Thread »
From Apache Jenkins Server <jenk...@builds.apache.org>
Subject Build failed in Jenkins: HttpComponents Client #344
Date Tue, 23 Aug 2011 19:07:25 GMT
See <https://builds.apache.org/job/HttpComponents%20Client/344/>

------------------------------------------
[...truncated 320 lines...]
[JENKINS] Archiving <https://builds.apache.org/job/HttpComponents%20Client/ws/httpclient-trunk/httpclient/target/httpclient-4.2-alpha1-SNAPSHOT-sources.jar>
to /home/hudson/hudson/jobs/HttpComponents Client/modules/org.apache.httpcomponents$httpclient/builds/2011-08-23_19-04-59/archive/org.apache.httpcomponents/httpclient/4.2-alpha1-SNAPSHOT/httpclient-4.2-alpha1-SNAPSHOT-sources.jar
[INFO] ------------------------------------------------------------------------
[INFO] Building HttpMime
[INFO]    task-segment: [clean, install]
[INFO] ------------------------------------------------------------------------
[INFO] [clean:clean {execution: default-clean}]
[INFO] Deleting <https://builds.apache.org/job/HttpComponents%20Client/ws/httpclient-trunk/httpmime/target>
[INFO] [notice:generate {execution: attach-notice-license}]
[INFO] Generating NOTICE and LICENSE resources
[INFO] [resources:resources {execution: default-resources}]
[INFO] Using 'UTF-8' encoding to copy filtered resources.
[INFO] Copying 1 resource
[INFO] Copying 2 resources to META-INF
[INFO] [compiler:compile {execution: default-compile}]
[INFO] Compiling 14 source files to <https://builds.apache.org/job/HttpComponents%20Client/ws/httpclient-trunk/httpmime/target/classes>
[INFO] [resources:testResources {execution: default-testResources}]
[INFO] Using 'UTF-8' encoding to copy filtered resources.
[INFO] skip non existing resourceDirectory <https://builds.apache.org/job/HttpComponents%20Client/ws/httpclient-trunk/httpmime/src/test/resources>
[INFO] Copying 2 resources to META-INF
[INFO] [compiler:testCompile {execution: default-testCompile}]
[INFO] Compiling 3 source files to <https://builds.apache.org/job/HttpComponents%20Client/ws/httpclient-trunk/httpmime/target/test-classes>
[INFO] [surefire:test {execution: default-test}]
[INFO] Surefire report directory: <https://builds.apache.org/job/HttpComponents%20Client/ws/httpclient-trunk/httpmime/target/surefire-reports>

-------------------------------------------------------
 T E S T S
-------------------------------------------------------
Running org.apache.http.entity.mime.TestMultipartContentBody
Tests run: 2, Failures: 0, Errors: 0, Skipped: 0, Time elapsed: 0.138 sec
Running org.apache.http.entity.mime.TestMultipartFormHttpEntity
Tests run: 4, Failures: 0, Errors: 0, Skipped: 0, Time elapsed: 0.041 sec
Running org.apache.http.entity.mime.TestMultipartForm
Tests run: 5, Failures: 0, Errors: 0, Skipped: 0, Time elapsed: 0.297 sec

Results :

Tests run: 11, Failures: 0, Errors: 0, Skipped: 0

[JENKINS] Recording test results
[INFO] [jar:jar {execution: default-jar}]
[INFO] Building jar: <https://builds.apache.org/job/HttpComponents%20Client/ws/httpclient-trunk/httpmime/target/httpmime-4.2-alpha1-SNAPSHOT.jar>
[INFO] Preparing source:jar
[WARNING] Removing: jar from forked lifecycle, to prevent recursive invocation.
[INFO] No goals needed for project - skipping
[INFO] [source:jar {execution: attach-sources}]
[INFO] Building jar: <https://builds.apache.org/job/HttpComponents%20Client/ws/httpclient-trunk/httpmime/target/httpmime-4.2-alpha1-SNAPSHOT-sources.jar>
[INFO] [install:install {execution: default-install}]
[INFO] Installing <https://builds.apache.org/job/HttpComponents%20Client/ws/httpclient-trunk/httpmime/target/httpmime-4.2-alpha1-SNAPSHOT.jar>
to /export/home/hudson/.m2/repository/org/apache/httpcomponents/httpmime/4.2-alpha1-SNAPSHOT/httpmime-4.2-alpha1-SNAPSHOT.jar
[INFO] Installing <https://builds.apache.org/job/HttpComponents%20Client/ws/httpclient-trunk/httpmime/target/httpmime-4.2-alpha1-SNAPSHOT-sources.jar>
to /export/home/hudson/.m2/repository/org/apache/httpcomponents/httpmime/4.2-alpha1-SNAPSHOT/httpmime-4.2-alpha1-SNAPSHOT-sources.jar
[JENKINS] Archiving <https://builds.apache.org/job/HttpComponents%20Client/ws/httpclient-trunk/httpmime/pom.xml>
to /home/hudson/hudson/jobs/HttpComponents Client/modules/org.apache.httpcomponents$httpmime/builds/2011-08-23_19-04-59/archive/org.apache.httpcomponents/httpmime/4.2-alpha1-SNAPSHOT/httpmime-4.2-alpha1-SNAPSHOT.pom
[JENKINS] Archiving <https://builds.apache.org/job/HttpComponents%20Client/ws/httpclient-trunk/httpmime/target/httpmime-4.2-alpha1-SNAPSHOT.jar>
to /home/hudson/hudson/jobs/HttpComponents Client/modules/org.apache.httpcomponents$httpmime/builds/2011-08-23_19-04-59/archive/org.apache.httpcomponents/httpmime/4.2-alpha1-SNAPSHOT/httpmime-4.2-alpha1-SNAPSHOT.jar
[JENKINS] Archiving <https://builds.apache.org/job/HttpComponents%20Client/ws/httpclient-trunk/httpmime/target/httpmime-4.2-alpha1-SNAPSHOT-sources.jar>
to /home/hudson/hudson/jobs/HttpComponents Client/modules/org.apache.httpcomponents$httpmime/builds/2011-08-23_19-04-59/archive/org.apache.httpcomponents/httpmime/4.2-alpha1-SNAPSHOT/httpmime-4.2-alpha1-SNAPSHOT-sources.jar
[INFO] ------------------------------------------------------------------------
[INFO] Building HttpClient Cache
[INFO]    task-segment: [clean, install]
[INFO] ------------------------------------------------------------------------
[INFO] [clean:clean {execution: default-clean}]
[INFO] Deleting <https://builds.apache.org/job/HttpComponents%20Client/ws/httpclient-trunk/httpclient-cache/target>
[INFO] [notice:generate {execution: attach-notice-license}]
[INFO] Generating NOTICE and LICENSE resources
[INFO] [resources:resources {execution: default-resources}]
[INFO] Using 'UTF-8' encoding to copy filtered resources.
[INFO] skip non existing resourceDirectory <https://builds.apache.org/job/HttpComponents%20Client/ws/httpclient-trunk/httpclient-cache/src/main/resources>
[INFO] Copying 2 resources to META-INF
[INFO] [compiler:compile {execution: default-compile}]
[INFO] Compiling 48 source files to <https://builds.apache.org/job/HttpComponents%20Client/ws/httpclient-trunk/httpclient-cache/target/classes>
[INFO] [resources:testResources {execution: default-testResources}]
[INFO] Using 'UTF-8' encoding to copy filtered resources.
[INFO] Copying 1 resource
[INFO] Copying 2 resources to META-INF
[INFO] [compiler:testCompile {execution: default-testCompile}]
[INFO] Compiling 36 source files to <https://builds.apache.org/job/HttpComponents%20Client/ws/httpclient-trunk/httpclient-cache/target/test-classes>
[INFO] [surefire:test {execution: default-test}]
[INFO] Surefire report directory: <https://builds.apache.org/job/HttpComponents%20Client/ws/httpclient-trunk/httpclient-cache/target/surefire-reports>

-------------------------------------------------------
 T E S T S
-------------------------------------------------------
Running org.apache.http.impl.client.cache.TestAsynchronousValidator
Tests run: 6, Failures: 0, Errors: 0, Skipped: 0, Time elapsed: 0.593 sec
Running org.apache.http.impl.client.cache.memcached.TestMemcachedHttpCacheStorage
Tests run: 8, Failures: 0, Errors: 0, Skipped: 0, Time elapsed: 0.469 sec
Running org.apache.http.impl.client.cache.ehcache.TestEhcacheProtocolRequirements
Tests run: 232, Failures: 0, Errors: 0, Skipped: 1, Time elapsed: 8.618 sec
Running org.apache.http.impl.client.cache.TestCacheEntryUpdater
Tests run: 10, Failures: 0, Errors: 0, Skipped: 0, Time elapsed: 0.029 sec
Running org.apache.http.impl.client.cache.TestCacheValidityPolicy
Tests run: 45, Failures: 0, Errors: 0, Skipped: 0, Time elapsed: 0.103 sec
Running org.apache.http.impl.client.cache.TestProtocolAllowedBehavior
Tests run: 2, Failures: 0, Errors: 0, Skipped: 0, Time elapsed: 0.009 sec
Running org.apache.http.impl.client.cache.TestWarningValue
Tests run: 17, Failures: 0, Errors: 0, Skipped: 0, Time elapsed: 0.021 sec
Running org.apache.http.impl.client.cache.TestCachedHttpResponseGenerator
Tests run: 7, Failures: 0, Errors: 0, Skipped: 0, Time elapsed: 0.022 sec
Running org.apache.http.client.cache.TestHttpCacheEntry
Tests run: 26, Failures: 0, Errors: 0, Skipped: 0, Time elapsed: 0.03 sec
Running org.apache.http.impl.client.cache.TestCachingHttpClient
Tests run: 54, Failures: 0, Errors: 0, Skipped: 0, Time elapsed: 1.017 sec
Running org.apache.http.impl.client.cache.TestSizeLimitedResponseReader
Tests run: 6, Failures: 0, Errors: 0, Skipped: 0, Time elapsed: 0.012 sec
Running org.apache.http.impl.client.cache.TestRFC5861Compliance
Tests run: 13, Failures: 0, Errors: 0, Skipped: 0, Time elapsed: 0.179 sec
Running org.apache.http.impl.client.cache.TestRequestProtocolCompliance
Tests run: 9, Failures: 0, Errors: 0, Skipped: 0, Time elapsed: 0.016 sec
Running org.apache.http.impl.client.cache.TestHttpCacheEntrySerializers
Tests run: 1, Failures: 0, Errors: 0, Skipped: 0, Time elapsed: 0.013 sec
Running org.apache.http.impl.client.cache.TestProtocolDeviations
Tests run: 5, Failures: 0, Errors: 0, Skipped: 0, Time elapsed: 0.025 sec
Running org.apache.http.impl.client.cache.ehcache.TestEhcacheHttpCacheStorage
Tests run: 8, Failures: 0, Errors: 0, Skipped: 0, Time elapsed: 0.12 sec
Running org.apache.http.impl.client.cache.TestResponseProtocolCompliance
Tests run: 4, Failures: 0, Errors: 0, Skipped: 0, Time elapsed: 0.131 sec
Running org.apache.http.impl.client.cache.TestProtocolRecommendations
Tests run: 86, Failures: 0, Errors: 0, Skipped: 0, Time elapsed: 0.63 sec
Running org.apache.http.impl.client.cache.TestResponseCachingPolicy
Tests run: 51, Failures: 0, Errors: 0, Skipped: 0, Time elapsed: 0.038 sec
Running org.apache.http.impl.client.cache.TestCachedResponseSuitabilityChecker
Tests run: 14, Failures: 0, Errors: 0, Skipped: 0, Time elapsed: 0.015 sec
Running org.apache.http.impl.client.cache.TestCombinedEntity
Tests run: 1, Failures: 0, Errors: 0, Skipped: 0, Time elapsed: 0.035 sec
Running org.apache.http.impl.client.cache.TestBasicHttpCache
Tests run: 19, Failures: 0, Errors: 0, Skipped: 0, Time elapsed: 0.026 sec
Running org.apache.http.impl.client.cache.TestCacheInvalidator
Tests run: 26, Failures: 0, Errors: 0, Skipped: 0, Time elapsed: 0.029 sec
Running org.apache.http.impl.client.cache.TestAsynchronousValidationRequest
Tests run: 3, Failures: 0, Errors: 0, Skipped: 0, Time elapsed: 0.012 sec
Running org.apache.http.impl.client.cache.TestConditionalRequestBuilder
Tests run: 17, Failures: 0, Errors: 0, Skipped: 0, Time elapsed: 0.014 sec
Running org.apache.http.impl.client.cache.TestCacheableRequestPolicy
Tests run: 4, Failures: 0, Errors: 0, Skipped: 0, Time elapsed: 0.005 sec
Running org.apache.http.impl.client.cache.TestProtocolRequirements
Tests run: 232, Failures: 0, Errors: 0, Skipped: 1, Time elapsed: 1.942 sec
Running org.apache.http.impl.client.cache.TestCacheKeyGenerator
Tests run: 22, Failures: 0, Errors: 0, Skipped: 0, Time elapsed: 0.051 sec

Results :

Tests run: 928, Failures: 0, Errors: 0, Skipped: 2

[JENKINS] Recording test results
[INFO] [jar:jar {execution: default-jar}]
[INFO] Building jar: <https://builds.apache.org/job/HttpComponents%20Client/ws/httpclient-trunk/httpclient-cache/target/httpclient-cache-4.2-alpha1-SNAPSHOT.jar>
[INFO] Preparing source:jar
[WARNING] Removing: jar from forked lifecycle, to prevent recursive invocation.
[INFO] No goals needed for project - skipping
[INFO] [source:jar {execution: attach-sources}]
[INFO] Building jar: <https://builds.apache.org/job/HttpComponents%20Client/ws/httpclient-trunk/httpclient-cache/target/httpclient-cache-4.2-alpha1-SNAPSHOT-sources.jar>
[INFO] [install:install {execution: default-install}]
[INFO] Installing <https://builds.apache.org/job/HttpComponents%20Client/ws/httpclient-trunk/httpclient-cache/target/httpclient-cache-4.2-alpha1-SNAPSHOT.jar>
to /export/home/hudson/.m2/repository/org/apache/httpcomponents/httpclient-cache/4.2-alpha1-SNAPSHOT/httpclient-cache-4.2-alpha1-SNAPSHOT.jar
[INFO] Installing <https://builds.apache.org/job/HttpComponents%20Client/ws/httpclient-trunk/httpclient-cache/target/httpclient-cache-4.2-alpha1-SNAPSHOT-sources.jar>
to /export/home/hudson/.m2/repository/org/apache/httpcomponents/httpclient-cache/4.2-alpha1-SNAPSHOT/httpclient-cache-4.2-alpha1-SNAPSHOT-sources.jar
[JENKINS] Archiving <https://builds.apache.org/job/HttpComponents%20Client/ws/httpclient-trunk/httpclient-cache/pom.xml>
to /home/hudson/hudson/jobs/HttpComponents Client/modules/org.apache.httpcomponents$httpclient-cache/builds/2011-08-23_19-04-59/archive/org.apache.httpcomponents/httpclient-cache/4.2-alpha1-SNAPSHOT/httpclient-cache-4.2-alpha1-SNAPSHOT.pom
[JENKINS] Archiving <https://builds.apache.org/job/HttpComponents%20Client/ws/httpclient-trunk/httpclient-cache/target/httpclient-cache-4.2-alpha1-SNAPSHOT.jar>
to /home/hudson/hudson/jobs/HttpComponents Client/modules/org.apache.httpcomponents$httpclient-cache/builds/2011-08-23_19-04-59/archive/org.apache.httpcomponents/httpclient-cache/4.2-alpha1-SNAPSHOT/httpclient-cache-4.2-alpha1-SNAPSHOT.jar
[JENKINS] Archiving <https://builds.apache.org/job/HttpComponents%20Client/ws/httpclient-trunk/httpclient-cache/target/httpclient-cache-4.2-alpha1-SNAPSHOT-sources.jar>
to /home/hudson/hudson/jobs/HttpComponents Client/modules/org.apache.httpcomponents$httpclient-cache/builds/2011-08-23_19-04-59/archive/org.apache.httpcomponents/httpclient-cache/4.2-alpha1-SNAPSHOT/httpclient-cache-4.2-alpha1-SNAPSHOT-sources.jar
[INFO] ------------------------------------------------------------------------
[INFO] Building Fluent HttpClient
[INFO]    task-segment: [clean, install]
[INFO] ------------------------------------------------------------------------
[INFO] [clean:clean {execution: default-clean}]
[INFO] [notice:generate {execution: attach-notice-license}]
[INFO] Generating NOTICE and LICENSE resources
[INFO] [resources:resources {execution: default-resources}]
[INFO] Using 'UTF-8' encoding to copy filtered resources.
[INFO] skip non existing resourceDirectory <https://builds.apache.org/job/HttpComponents%20Client/ws/httpclient-trunk/fluent-hc/src/main/resources>
[INFO] Copying 2 resources to META-INF
[INFO] [compiler:compile {execution: default-compile}]
[INFO] Compiling 8 source files to <https://builds.apache.org/job/HttpComponents%20Client/ws/httpclient-trunk/fluent-hc/target/classes>
[INFO] [resources:testResources {execution: default-testResources}]
[INFO] Using 'UTF-8' encoding to copy filtered resources.
[INFO] skip non existing resourceDirectory <https://builds.apache.org/job/HttpComponents%20Client/ws/httpclient-trunk/fluent-hc/src/test/resources>
[INFO] Copying 2 resources to META-INF
[INFO] [compiler:testCompile {execution: default-testCompile}]
[INFO] Compiling 1 source file to <https://builds.apache.org/job/HttpComponents%20Client/ws/httpclient-trunk/fluent-hc/target/test-classes>
[INFO] [surefire:test {execution: default-test}]
[INFO] Surefire report directory: <https://builds.apache.org/job/HttpComponents%20Client/ws/httpclient-trunk/fluent-hc/target/surefire-reports>

-------------------------------------------------------
 T E S T S
-------------------------------------------------------
Running org.apache.http.client.fluent.TestFluentRequest
Tests run: 37, Failures: 0, Errors: 0, Skipped: 0, Time elapsed: 1.372 sec

Results :

Tests run: 37, Failures: 0, Errors: 0, Skipped: 0

[JENKINS] Recording test results
[INFO] [jar:jar {execution: default-jar}]
[INFO] Building jar: <https://builds.apache.org/job/HttpComponents%20Client/ws/httpclient-trunk/fluent-hc/target/fluent-hc-4.2-alpha1-SNAPSHOT.jar>
[INFO] Preparing source:jar
[WARNING] Removing: jar from forked lifecycle, to prevent recursive invocation.
[INFO] No goals needed for project - skipping
[INFO] [source:jar {execution: attach-sources}]
[INFO] Building jar: <https://builds.apache.org/job/HttpComponents%20Client/ws/httpclient-trunk/fluent-hc/target/fluent-hc-4.2-alpha1-SNAPSHOT-sources.jar>
[INFO] [install:install {execution: default-install}]
[INFO] Installing <https://builds.apache.org/job/HttpComponents%20Client/ws/httpclient-trunk/fluent-hc/target/fluent-hc-4.2-alpha1-SNAPSHOT.jar>
to /export/home/hudson/.m2/repository/org/apache/httpcomponents/fluent-hc/4.2-alpha1-SNAPSHOT/fluent-hc-4.2-alpha1-SNAPSHOT.jar
[INFO] Installing <https://builds.apache.org/job/HttpComponents%20Client/ws/httpclient-trunk/fluent-hc/target/fluent-hc-4.2-alpha1-SNAPSHOT-sources.jar>
to /export/home/hudson/.m2/repository/org/apache/httpcomponents/fluent-hc/4.2-alpha1-SNAPSHOT/fluent-hc-4.2-alpha1-SNAPSHOT-sources.jar
[JENKINS] Archiving <https://builds.apache.org/job/HttpComponents%20Client/ws/httpclient-trunk/fluent-hc/pom.xml>
to /home/hudson/hudson/jobs/HttpComponents Client/modules/org.apache.httpcomponents$fluent-hc/builds/2011-08-23_19-04-59/archive/org.apache.httpcomponents/fluent-hc/4.2-alpha1-SNAPSHOT/fluent-hc-4.2-alpha1-SNAPSHOT.pom
[JENKINS] Archiving <https://builds.apache.org/job/HttpComponents%20Client/ws/httpclient-trunk/fluent-hc/target/fluent-hc-4.2-alpha1-SNAPSHOT.jar>
to /home/hudson/hudson/jobs/HttpComponents Client/modules/org.apache.httpcomponents$fluent-hc/builds/2011-08-23_19-04-59/archive/org.apache.httpcomponents/fluent-hc/4.2-alpha1-SNAPSHOT/fluent-hc-4.2-alpha1-SNAPSHOT.jar
[JENKINS] Archiving <https://builds.apache.org/job/HttpComponents%20Client/ws/httpclient-trunk/fluent-hc/target/fluent-hc-4.2-alpha1-SNAPSHOT-sources.jar>
to /home/hudson/hudson/jobs/HttpComponents Client/modules/org.apache.httpcomponents$fluent-hc/builds/2011-08-23_19-04-59/archive/org.apache.httpcomponents/fluent-hc/4.2-alpha1-SNAPSHOT/fluent-hc-4.2-alpha1-SNAPSHOT-sources.jar
[INFO] ------------------------------------------------------------------------
[INFO] Building HttpClient OSGi bundle
[INFO]    task-segment: [clean, install]
[INFO] ------------------------------------------------------------------------
[INFO] [clean:clean {execution: default-clean}]
[INFO] Deleting <https://builds.apache.org/job/HttpComponents%20Client/ws/httpclient-trunk/httpclient-osgi/target>
[INFO] [notice:generate {execution: attach-notice-license}]
[INFO] Generating NOTICE and LICENSE resources
[INFO] [resources:resources {execution: default-resources}]
[INFO] Using 'UTF-8' encoding to copy filtered resources.
[INFO] skip non existing resourceDirectory <https://builds.apache.org/job/HttpComponents%20Client/ws/httpclient-trunk/httpclient-osgi/src/main/resources>
[INFO] Copying 2 resources to META-INF
[INFO] [compiler:compile {execution: default-compile}]
[INFO] No sources to compile
[INFO] [resources:testResources {execution: default-testResources}]
[INFO] Using 'UTF-8' encoding to copy filtered resources.
[INFO] skip non existing resourceDirectory <https://builds.apache.org/job/HttpComponents%20Client/ws/httpclient-trunk/httpclient-osgi/src/test/resources>
[INFO] Copying 2 resources to META-INF
[INFO] [compiler:testCompile {execution: default-testCompile}]
[INFO] No sources to compile
[INFO] [surefire:test {execution: default-test}]
[INFO] Surefire report directory: <https://builds.apache.org/job/HttpComponents%20Client/ws/httpclient-trunk/httpclient-osgi/target/surefire-reports>

-------------------------------------------------------
 T E S T S
-------------------------------------------------------
There are no tests to run.

Results :

Tests run: 0, Failures: 0, Errors: 0, Skipped: 0

[JENKINS] Recording test results
[INFO] [bundle:bundle {execution: default-bundle}]
[ERROR] Error building bundle org.apache.httpcomponents:httpclient-osgi:bundle:4.2-alpha1-SNAPSHOT
: Unresolved references to [org.apache.http.pool] by class(es) on the Bundle-Classpath[Jar:dot]:
[org/apache/http/impl/conn/HttpConnPool.class, org/apache/http/impl/conn/HttpPoolEntry.class,
org/apache/http/impl/conn/PoolingClientConnectionManager.class]
[ERROR] Error(s) found in bundle configuration
[JENKINS] Archiving <https://builds.apache.org/job/HttpComponents%20Client/ws/httpclient-trunk/httpclient-osgi/pom.xml>
to /home/hudson/hudson/jobs/HttpComponents Client/modules/org.apache.httpcomponents$httpclient-osgi/builds/2011-08-23_19-04-59/archive/org.apache.httpcomponents/httpclient-osgi/4.2-alpha1-SNAPSHOT/httpclient-osgi-4.2-alpha1-SNAPSHOT.pom
[INFO] ------------------------------------------------------------------------
[ERROR] BUILD ERROR
[INFO] ------------------------------------------------------------------------
[INFO] Error(s) found in bundle configuration
[INFO] ------------------------------------------------------------------------
[INFO] For more information, run Maven with the -e switch
[INFO] ------------------------------------------------------------------------
[INFO] Total time: 2 minutes 13 seconds
[INFO] Finished at: Tue Aug 23 15:07:23 EDT 2011
[INFO] Final Memory: 53M/188M
[INFO] ------------------------------------------------------------------------
Sending e-mails to: commits@hc.apache.org
channel stopped


Mime
View raw message