hc-commits mailing list archives

Site index · List index
Message view « Date » · « Thread »
Top « Date » · « Thread »
From Apache Jenkins Server <jenk...@builds.apache.org>
Subject Build failed in Jenkins: HttpComponents AsyncClient #44
Date Tue, 28 Jun 2011 00:51:19 GMT
See <https://builds.apache.org/job/HttpComponents%20AsyncClient/44/changes>

Changes:

[olegk] Fixed broken test case

------------------------------------------
Started by an SCM change
Building remotely on ubuntu2
Updating http://svn.apache.org/repos/asf/httpcomponents/httpasyncclient/trunk
U         httpasyncclient/src/test/java/org/apache/http/impl/nio/pool/TestSessionPool.java
At revision 1140390
Found mavenVersion 2.2.1 from file jar:file:/home/hudson/tools/maven/apache-maven-2.2.1/lib/maven-2.2.1-uber.jar!/META-INF/maven/org.apache.maven/maven-core/pom.properties
Parsing POMs
[httpasyncclient-trunk] $ java -cp /home/hudson/hudson-slave/maven-agent.jar:/home/hudson/hudson-slave/classworlds.jar
hudson.maven.agent.Main /home/hudson/tools/maven/apache-maven-2.2.1 /home/hudson/hudson-slave/slave.jar
/home/hudson/hudson-slave/maven-interceptor.jar 42348 /home/hudson/hudson-slave/maven2.1-interceptor.jar
<===[HUDSON REMOTING CAPACITY]===channel started
>   Executing Maven:  -B -f <https://builds.apache.org/job/HttpComponents%20AsyncClient/ws/httpasyncclient-trunk/pom.xml>
clean install
[INFO] Scanning for projects...
[INFO] Reactor build order: 
[INFO]   HttpComponents AsyncClient
[INFO]   HttpAsyncClient
[INFO] ------------------------------------------------------------------------
[INFO] Building HttpComponents AsyncClient
[INFO]    task-segment: [clean, install]
[INFO] ------------------------------------------------------------------------
[INFO] [clean:clean {execution: default-clean}]
[INFO] Deleting <https://builds.apache.org/job/HttpComponents%20AsyncClient/ws/httpasyncclient-trunk/target>
[INFO] [notice:generate {execution: attach-notice-license}]
[INFO] [site:attach-descriptor {execution: default-attach-descriptor}]
[INFO] Parent project loaded from repository.
[INFO] Preparing source:jar
[WARNING] Removing: jar from forked lifecycle, to prevent recursive invocation.
[INFO] No goals needed for project - skipping
[INFO] [source:jar {execution: attach-sources}]
[INFO] [install:install {execution: default-install}]
[INFO] Installing <https://builds.apache.org/job/HttpComponents%20AsyncClient/ws/httpasyncclient-trunk/pom.xml>
to /home/hudson/.m2/repository/org/apache/httpcomponents/httpcomponents-asyncclient/4.0-alpha3-SNAPSHOT/httpcomponents-asyncclient-4.0-alpha3-SNAPSHOT.pom
[INFO] Installing <https://builds.apache.org/job/HttpComponents%20AsyncClient/ws/httpasyncclient-trunk/target/httpcomponents-asyncclient-4.0-alpha3-SNAPSHOT-site.xml>
to /home/hudson/.m2/repository/org/apache/httpcomponents/httpcomponents-asyncclient/4.0-alpha3-SNAPSHOT/httpcomponents-asyncclient-4.0-alpha3-SNAPSHOT-site.xml
[JENKINS] Archiving <https://builds.apache.org/job/HttpComponents%20AsyncClient/ws/httpasyncclient-trunk/pom.xml>
to /home/hudson/hudson/jobs/HttpComponents AsyncClient/modules/org.apache.httpcomponents$httpcomponents-asyncclient/builds/2011-06-28_00-50-34/archive/org.apache.httpcomponents/httpcomponents-asyncclient/4.0-alpha3-SNAPSHOT/httpcomponents-asyncclient-4.0-alpha3-SNAPSHOT.pom
[JENKINS] Archiving <https://builds.apache.org/job/HttpComponents%20AsyncClient/ws/httpasyncclient-trunk/target/httpcomponents-asyncclient-4.0-alpha3-SNAPSHOT-site.xml>
to /home/hudson/hudson/jobs/HttpComponents AsyncClient/modules/org.apache.httpcomponents$httpcomponents-asyncclient/builds/2011-06-28_00-50-34/archive/org.apache.httpcomponents/httpcomponents-asyncclient/4.0-alpha3-SNAPSHOT/httpcomponents-asyncclient-4.0-alpha3-SNAPSHOT-site.xml
[INFO] ------------------------------------------------------------------------
[INFO] Building HttpAsyncClient
[INFO]    task-segment: [clean, install]
[INFO] ------------------------------------------------------------------------
[INFO] [clean:clean {execution: default-clean}]
[INFO] Deleting <https://builds.apache.org/job/HttpComponents%20AsyncClient/ws/httpasyncclient-trunk/httpasyncclient/target>
[INFO] [notice:generate {execution: attach-notice-license}]
[INFO] Generating NOTICE and LICENSE resources
[INFO] [resources:resources {execution: default-resources}]
[INFO] Using 'UTF-8' encoding to copy filtered resources.
[INFO] Copying 1 resource
[INFO] Copying 2 resources to META-INF
[INFO] [compiler:compile {execution: default-compile}]
[INFO] Compiling 60 source files to <https://builds.apache.org/job/HttpComponents%20AsyncClient/ws/httpasyncclient-trunk/httpasyncclient/target/classes>
[INFO] -------------------------------------------------------------
[ERROR] COMPILATION ERROR : 
[INFO] -------------------------------------------------------------
[ERROR] Unable to locate the Javac Compiler in:
  /usr/lib/jvm/java-6-openjdk/jre/../lib/tools.jar
Please ensure you are using JDK 1.4 or above and
not a JRE (the com.sun.tools.javac.Main class is required).
In most cases you can change the location of your Java
installation by setting the JAVA_HOME environment variable.
[INFO] 1error
[INFO] -------------------------------------------------------------
[JENKINS] Archiving <https://builds.apache.org/job/HttpComponents%20AsyncClient/ws/httpasyncclient-trunk/httpasyncclient/pom.xml>
to /home/hudson/hudson/jobs/HttpComponents AsyncClient/modules/org.apache.httpcomponents$httpasyncclient/builds/2011-06-28_00-50-34/archive/org.apache.httpcomponents/httpasyncclient/4.0-alpha3-SNAPSHOT/httpasyncclient-4.0-alpha3-SNAPSHOT.pom
[INFO] ------------------------------------------------------------------------
[ERROR] BUILD FAILURE
[INFO] ------------------------------------------------------------------------
[INFO] Compilation failure
Unable to locate the Javac Compiler in:
  /usr/lib/jvm/java-6-openjdk/jre/../lib/tools.jar
Please ensure you are using JDK 1.4 or above and
not a JRE (the com.sun.tools.javac.Main class is required).
In most cases you can change the location of your Java
installation by setting the JAVA_HOME environment variable.

[INFO] ------------------------------------------------------------------------
[INFO] For more information, run Maven with the -e switch
[INFO] ------------------------------------------------------------------------
[INFO] Total time: 13 seconds
[INFO] Finished at: Tue Jun 28 00:51:18 UTC 2011
[INFO] Final Memory: 37M/283M
[INFO] ------------------------------------------------------------------------
Sending e-mails to: commits@hc.apache.org
channel stopped


Mime
View raw message