hc-commits mailing list archives

Site index · List index
Message view « Date » · « Thread »
Top « Date » · « Thread »
From Apache Jenkins Server <hud...@hudson.apache.org>
Subject Build failed in Jenkins: HttpComponents AsyncClient » HttpAsyncClient #30
Date Thu, 19 May 2011 00:48:37 GMT
See <https://builds.apache.org/hudson/job/HttpComponents%20AsyncClient/org.apache.httpcomponents$httpasyncclient/30/changes>

Changes:

[olegk] Updated dependency declarations; upgraded HttpCore to 4.1.1

------------------------------------------
[INFO] ------------------------------------------------------------------------
[INFO] Building HttpAsyncClient
[INFO]    task-segment: [clean, install]
[INFO] ------------------------------------------------------------------------
[INFO] [clean:clean {execution: default-clean}]
[INFO] Deleting <https://builds.apache.org/hudson/job/HttpComponents%20AsyncClient/org.apache.httpcomponents$httpasyncclient/ws/target>
[INFO] [notice:generate {execution: attach-notice-license}]
[INFO] Generating NOTICE and LICENSE resources
[INFO] [resources:resources {execution: default-resources}]
[INFO] Using 'UTF-8' encoding to copy filtered resources.
[INFO] Copying 1 resource
[INFO] Copying 2 resources to META-INF
Downloading: http://repo1.maven.org/maven2/org/apache/httpcomponents/httpcore/4.1.1/httpcore-4.1.1.pom

Downloading: http://repo1.maven.org/maven2/org/apache/httpcomponents/httpcomponents-core/4.1.1/httpcomponents-core-4.1.1.pom

Downloading: http://repo1.maven.org/maven2/org/apache/httpcomponents/httpcore-nio/4.1.1/httpcore-nio-4.1.1.pom

Downloading: http://repo1.maven.org/maven2/org/apache/httpcomponents/httpcore/4.1.1/httpcore-4.1.1.jar

Downloading: http://repo1.maven.org/maven2/org/apache/httpcomponents/httpcore-nio/4.1.1/httpcore-nio-4.1.1.jar

[INFO] [compiler:compile {execution: default-compile}]
[INFO] Compiling 60 source files to <https://builds.apache.org/hudson/job/HttpComponents%20AsyncClient/org.apache.httpcomponents$httpasyncclient/ws/target/classes>
[INFO] -------------------------------------------------------------
[ERROR] COMPILATION ERROR : 
[INFO] -------------------------------------------------------------
[ERROR] Unable to locate the Javac Compiler in:
  /usr/lib/jvm/java-6-openjdk/jre/../lib/tools.jar
Please ensure you are using JDK 1.4 or above and
not a JRE (the com.sun.tools.javac.Main class is required).
In most cases you can change the location of your Java
installation by setting the JAVA_HOME environment variable.
[INFO] 1error
[INFO] -------------------------------------------------------------
[JENKINS] Archiving <https://builds.apache.org/hudson/job/HttpComponents%20AsyncClient/org.apache.httpcomponents$httpasyncclient/ws/pom.xml>
to /home/hudson/hudson/jobs/HttpComponents AsyncClient/modules/org.apache.httpcomponents$httpasyncclient/builds/2011-05-19_00-47-56/archive/org.apache.httpcomponents/httpasyncclient/4.0-alpha2-SNAPSHOT/httpasyncclient-4.0-alpha2-SNAPSHOT.pom
[INFO] ------------------------------------------------------------------------
[ERROR] BUILD FAILURE
[INFO] ------------------------------------------------------------------------
[INFO] Compilation failure
Unable to locate the Javac Compiler in:
  /usr/lib/jvm/java-6-openjdk/jre/../lib/tools.jar
Please ensure you are using JDK 1.4 or above and
not a JRE (the com.sun.tools.javac.Main class is required).
In most cases you can change the location of your Java
installation by setting the JAVA_HOME environment variable.

[INFO] ------------------------------------------------------------------------
[INFO] For more information, run Maven with the -e switch
[INFO] ------------------------------------------------------------------------
[INFO] Total time: 16 seconds
[INFO] Finished at: Wed May 18 17:48:36 PDT 2011
[INFO] Final Memory: 38M/348M
[INFO] ------------------------------------------------------------------------


Mime
View raw message