hc-commits mailing list archives

Site index · List index
Message view « Date » · « Thread »
Top « Date » · « Thread »
From Continuum VMBuild Server <contin...@apache.org>
Subject [continuum] BUILD FAILURE: HttpComponents Core
Date Sun, 02 Mar 2008 12:40:39 GMT
Online report : http://vmbuild.apache.org/continuum/buildResult.action?buildId=58420&projectId=350

Build statistics:
  State: Failed
  Previous State: Ok
  Started at: Sun 2 Mar 2008 04:36:07 -0800
  Finished at: Sun 2 Mar 2008 04:39:55 -0800
  Total time: 3m 47s
  Build Trigger: Schedule
  Build Number: 15
  Exit code: 1
  Building machine hostname: vmbuild.apache.org
  Operating system : Linux(unknown)
  Java Home version : 
          java version "1.5.0_12"
          Java(TM) 2 Runtime Environment, Standard Edition (build 1.5.0_12-b04)
          Java HotSpot(TM) Client VM (build 1.5.0_12-b04, mixed mode, sharing)
        
  Builder version :
          Maven version: 2.0.7
          Java version: 1.5.0_12
          OS name: "linux" version: "2.6.20-16-server" arch: "i386"
    
****************************************************************************
SCM Changes:
****************************************************************************
Changed: olegk @ Sun 2 Mar 2008 04:23:03 -0800
Comment: Rewrite of BufferingHttpServiceHandler as a decorator for NHttpAsyncServiceHandler
Files changed:
  /httpcomponents/httpcore/trunk/module-nio/src/examples/org/apache/http/examples/nio/NHttpFileServer.java
( 632746 )
  /httpcomponents/httpcore/trunk/module-nio/src/examples/org/apache/http/examples/nio/NHttpServer.java
( 632746 )
  /httpcomponents/httpcore/trunk/module-nio/src/main/java/org/apache/http/nio/entity/NFileEntity.java
( 632746 )
  /httpcomponents/httpcore/trunk/module-nio/src/main/java/org/apache/http/nio/entity/NHttpEntityWrapper.java
( 632746 )
  /httpcomponents/httpcore/trunk/module-nio/src/main/java/org/apache/http/nio/protocol/AsyncNHttpServiceHandler.java
( 632746 )
  /httpcomponents/httpcore/trunk/module-nio/src/main/java/org/apache/http/nio/protocol/BufferingHttpServiceHandler.java
( 632746 )
  /httpcomponents/httpcore/trunk/module-nio/src/main/java/org/apache/http/nio/protocol/NHttpClientHandlerBase.java
( 632746 )
  /httpcomponents/httpcore/trunk/module-nio/src/test/java/org/apache/http/nio/protocol/TestBufferingNHttpHandlers.java
( 632746 )

****************************************************************************
Dependencies Changes:
****************************************************************************
No dependencies changed


****************************************************************************
Build Defintion:
****************************************************************************
POM filename: pom.xml
Goals: clean package   
Arguments: --batch-mode
Build Fresh: false
Always Build: false
Default Build Definition: true
Schedule: DEFAULT_SCHEDULE
Profile Name: Java 5
Description: 


****************************************************************************
Test Summary:
****************************************************************************
Tests: 510
Failures: 1
Total time: 34549

****************************************************************************
Output:
****************************************************************************
[INFO] Scanning for projects...
[INFO] Reactor build order: 
[INFO]   HttpComponents Core
[INFO]   HttpCore (base module)
[INFO]   HttpCore (NIO extensions module)
[INFO] ----------------------------------------------------------------------------
[INFO] Building HttpComponents Core
[INFO]    task-segment: [clean, package]
[INFO] ----------------------------------------------------------------------------
[INFO] [clean:clean]
[INFO] Deleting directory /home/continuum/data/working-directory/350/target
[INFO] Deleting directory /home/continuum/data/working-directory/350/target/classes
[INFO] Deleting directory /home/continuum/data/working-directory/350/target/test-classes
[INFO] Deleting directory /home/continuum/data/working-directory/350/target/site
[INFO] [site:attach-descriptor]
[WARNING] Unable to load parent project from repository: Could not find the model file '/home/continuum/data/working-directory/350/../project/pom.xml'.
for project unknown
[INFO] ----------------------------------------------------------------------------
[INFO] Building HttpCore (base module)
[INFO]    task-segment: [clean, package]
[INFO] ----------------------------------------------------------------------------
[INFO] [clean:clean]
[INFO] Deleting directory /home/continuum/data/working-directory/350/module-main/target
[INFO] Deleting directory /home/continuum/data/working-directory/350/module-main/target/classes
[INFO] Deleting directory /home/continuum/data/working-directory/350/module-main/target/test-classes
[INFO] Deleting directory /home/continuum/data/working-directory/350/module-main/target/site
[INFO] [resources:resources]
[INFO] Using default encoding to copy filtered resources.
[INFO] [compiler:compile]
[INFO] Compiling 155 source files to /home/continuum/data/working-directory/350/module-main/target/classes
[INFO] [resources:testResources]
[INFO] Using default encoding to copy filtered resources.
[INFO] [compiler:testCompile]
[INFO] Compiling 69 source files to /home/continuum/data/working-directory/350/module-main/target/test-classes
[INFO] [surefire:test]
[INFO] Surefire report directory: /home/continuum/data/working-directory/350/module-main/target/surefire-reports

-------------------------------------------------------
 T E S T S
-------------------------------------------------------
Running org.apache.http.TestAll
Tests run: 400, Failures: 0, Errors: 0, Skipped: 0, Time elapsed: 2.703 sec

Results :

Tests run: 400, Failures: 0, Errors: 0, Skipped: 0

[INFO] [jar:jar]
[INFO] Building jar: /home/continuum/data/working-directory/350/module-main/target/httpcore-4.0-beta2-SNAPSHOT.jar
[INFO] ----------------------------------------------------------------------------
[INFO] Building HttpCore (NIO extensions module)
[INFO]    task-segment: [clean, package]
[INFO] ----------------------------------------------------------------------------
[INFO] [clean:clean]
[INFO] Deleting directory /home/continuum/data/working-directory/350/module-nio/target
[INFO] Deleting directory /home/continuum/data/working-directory/350/module-nio/target/classes
[INFO] Deleting directory /home/continuum/data/working-directory/350/module-nio/target/test-classes
[INFO] Deleting directory /home/continuum/data/working-directory/350/module-nio/target/site
[INFO] [resources:resources]
[INFO] Using default encoding to copy filtered resources.
[INFO] [compiler:compile]
[INFO] Compiling 120 source files to /home/continuum/data/working-directory/350/module-nio/target/classes
[INFO] [resources:testResources]
[INFO] Using default encoding to copy filtered resources.
[INFO] [compiler:testCompile]
[INFO] Compiling 38 source files to /home/continuum/data/working-directory/350/module-nio/target/test-classes
[INFO] [surefire:test]
[INFO] Surefire report directory: /home/continuum/data/working-directory/350/module-nio/target/surefire-reports

-------------------------------------------------------
 T E S T S
-------------------------------------------------------
Running org.apache.http.nio.TestAll
Tests run: 110, Failures: 1, Errors: 0, Skipped: 0, Time elapsed: 31.92 sec <<< FAILURE!

Results :

Failed tests: 
  testSimpleBasicHttpEntityEnclosingRequestsChunked(org.apache.http.nio.protocol.TestNIOSSLHttp)

Tests run: 110, Failures: 1, Errors: 0, Skipped: 0

[INFO] ------------------------------------------------------------------------
[ERROR] BUILD FAILURE
[INFO] ------------------------------------------------------------------------
[INFO] There are test failures.
[INFO] ------------------------------------------------------------------------
[INFO] For more information, run Maven with the -e switch
[INFO] ------------------------------------------------------------------------
[INFO] Total time: 2 minutes 34 seconds
[INFO] Finished at: Sun Mar 02 04:39:54 PST 2008
[INFO] Final Memory: 10M/18M
[INFO] ------------------------------------------------------------------------

****************************************************************************



Mime
View raw message