hc-commits mailing list archives

Site index · List index
Message view « Date » · « Thread »
Top « Date » · « Thread »
From Continuum VMBuild Server <contin...@apache.org>
Subject [continuum] BUILD FAILURE: HttpComponents Client
Date Fri, 29 Feb 2008 13:59:30 GMT
Online report : http://vmbuild.apache.org/continuum/buildResult.action?buildId=57527&projectId=353

Build statistics:
  State: Failed
  Previous State: Ok
  Started at: Fri 29 Feb 2008 05:57:54 -0800
  Finished at: Fri 29 Feb 2008 05:59:09 -0800
  Total time: 1m 15s
  Build Trigger: Schedule
  Build Number: 25
  Exit code: 1
  Building machine hostname: vmbuild.apache.org
  Operating system : Linux(unknown)
  Java Home version : 
          java version "1.5.0_12"
          Java(TM) 2 Runtime Environment, Standard Edition (build 1.5.0_12-b04)
          Java HotSpot(TM) Client VM (build 1.5.0_12-b04, mixed mode, sharing)
        
  Builder version :
          Maven version: 2.0.7
          Java version: 1.5.0_12
          OS name: "linux" version: "2.6.20-16-server" arch: "i386"
    
****************************************************************************
SCM Changes:
****************************************************************************
Changed: olegk @ Fri 29 Feb 2008 05:19:50 -0800
Comment: HTTPCLIENT-749: HttpParams beans
Contributed by Stojce Dimski <sdmiski at yahoo.it>
Files changed:
  /httpcomponents/httpclient/trunk/RELEASE_NOTES.txt ( 632313 )
  /httpcomponents/httpclient/trunk/module-client/src/main/java/org/apache/http/auth/params/AuthParamBean.java
( 632313 )
  /httpcomponents/httpclient/trunk/module-client/src/main/java/org/apache/http/client/params/ClientParamBean.java
( 632313 )
  /httpcomponents/httpclient/trunk/module-client/src/main/java/org/apache/http/client/protocol/ClientContextConfigurer.java
( 632313 )
  /httpcomponents/httpclient/trunk/module-client/src/main/java/org/apache/http/conn/params/ConnConnectionParamBean.java
( 632313 )
  /httpcomponents/httpclient/trunk/module-client/src/main/java/org/apache/http/conn/params/ConnManagerParamBean.java
( 632313 )
  /httpcomponents/httpclient/trunk/module-client/src/main/java/org/apache/http/conn/params/ConnRouteParamBean.java
( 632313 )
  /httpcomponents/httpclient/trunk/module-client/src/main/java/org/apache/http/cookie/params/CookieSpecParamBean.java
( 632313 )

****************************************************************************
Dependencies Changes:
****************************************************************************
No dependencies changed


****************************************************************************
Build Defintion:
****************************************************************************
POM filename: pom.xml
Goals: clean package assembly:assembly   
Arguments: --batch-mode
Build Fresh: false
Always Build: false
Default Build Definition: true
Schedule: DEFAULT_SCHEDULE
Profile Name: Java 5
Description: 


****************************************************************************
Test Summary:
****************************************************************************
Tests: 330
Failures: 1
Total time: 16826

****************************************************************************
Output:
****************************************************************************
[INFO] Scanning for projects...
[INFO] Reactor build order: 
[INFO]   HttpComponents Client
[INFO]   HttpClient (base module)
[INFO]   HttpClient (MIME entities)
[INFO] Searching repository for plugin with prefix: 'assembly'.
[INFO] ----------------------------------------------------------------------------
[INFO] Building HttpComponents Client
[INFO]    task-segment: [clean, package]
[INFO] ----------------------------------------------------------------------------
[INFO] [clean:clean]
[INFO] Deleting directory /home/continuum/data/working-directory/353/target
[INFO] Deleting directory /home/continuum/data/working-directory/353/target/classes
[INFO] Deleting directory /home/continuum/data/working-directory/353/target/test-classes
[INFO] Deleting directory /home/continuum/data/working-directory/353/target/site
[INFO] [site:attach-descriptor]
[WARNING] Unable to load parent project from repository: Could not find the model file '/home/continuum/data/working-directory/353/../project/pom.xml'.
for project unknown
[INFO] ----------------------------------------------------------------------------
[INFO] Building HttpClient (base module)
[INFO]    task-segment: [clean, package]
[INFO] ----------------------------------------------------------------------------
[INFO] [clean:clean]
[INFO] Deleting directory /home/continuum/data/working-directory/353/module-client/target
[INFO] Deleting directory /home/continuum/data/working-directory/353/module-client/target/classes
[INFO] Deleting directory /home/continuum/data/working-directory/353/module-client/target/test-classes
[INFO] Deleting directory /home/continuum/data/working-directory/353/module-client/target/site
[INFO] [resources:resources]
[INFO] Using default encoding to copy filtered resources.
[INFO] [compiler:compile]
[INFO] Compiling 182 source files to /home/continuum/data/working-directory/353/module-client/target/classes
[INFO] [resources:testResources]
[INFO] Using default encoding to copy filtered resources.
[INFO] [compiler:testCompile]
[INFO] Compiling 69 source files to /home/continuum/data/working-directory/353/module-client/target/test-classes
[INFO] [surefire:test]
[INFO] Surefire report directory: /home/continuum/data/working-directory/353/module-client/target/surefire-reports

-------------------------------------------------------
 T E S T S
-------------------------------------------------------
Running org.apache.http.client.TestAll
Tests run: 320, Failures: 0, Errors: 1, Skipped: 0, Time elapsed: 16.222 sec <<<
FAILURE!

Results :

Tests in error: 
  testReleaseConnection(org.apache.http.impl.conn.TestTSCCMWithServer)

Tests run: 320, Failures: 0, Errors: 1, Skipped: 0

[INFO] ------------------------------------------------------------------------
[ERROR] BUILD FAILURE
[INFO] ------------------------------------------------------------------------
[INFO] There are test failures.
[INFO] ------------------------------------------------------------------------
[INFO] For more information, run Maven with the -e switch
[INFO] ------------------------------------------------------------------------
[INFO] Total time: 55 seconds
[INFO] Finished at: Fri Feb 29 05:59:09 PST 2008
[INFO] Final Memory: 10M/23M
[INFO] ------------------------------------------------------------------------

****************************************************************************



Mime
View raw message