hc-commits mailing list archives

Site index · List index
Message view « Date » · « Thread »
Top « Date » · « Thread »
From Continuum VMBuild Server <contin...@apache.org>
Subject [continuum] BUILD FAILURE: HttpComponents Client
Date Sun, 17 Feb 2008 17:05:08 GMT
Online report : http://vmbuild.apache.org/continuum/buildResult.action?buildId=51953&projectId=353

Build statistics:
  State: Failed
  Previous State: Failed
  Started at: Sun 17 Feb 2008 09:03:49 -0800
  Finished at: Sun 17 Feb 2008 09:04:52 -0800
  Total time: 1m 3s
  Build Trigger: Schedule
  Build Number: 15
  Exit code: 1
  Building machine hostname: vmbuild.apache.org
  Operating system : Linux(unknown)
  Java Home version : 
          java version "1.5.0_12"
          Java(TM) 2 Runtime Environment, Standard Edition (build 1.5.0_12-b04)
          Java HotSpot(TM) Client VM (build 1.5.0_12-b04, mixed mode, sharing)
        
  Builder version :
          Maven version: 2.0.7
          Java version: 1.5.0_12
          OS name: "linux" version: "2.6.20-16-server" arch: "i386"
    
****************************************************************************
SCM Changes:
****************************************************************************
Changed: erikabele @ Sun 17 Feb 2008 08:55:51 -0800
Comment: Fix link.
Files changed:
  /httpcomponents/httpclient/trunk/src/site/apt/index.apt ( 628514 )

Changed: erikabele @ Sun 17 Feb 2008 08:56:41 -0800
Comment: Fix link to license.
Files changed:
  /httpcomponents/httpclient/trunk/src/site/apt/download.apt ( 628516 )

****************************************************************************
Dependencies Changes:
****************************************************************************
No dependencies changed


****************************************************************************
Build Defintion:
****************************************************************************
POM filename: pom.xml
Goals: clean package assembly:assembly   
Arguments: --batch-mode
Build Fresh: false
Always Build: false
Default Build Definition: true
Schedule: DEFAULT_SCHEDULE
Profile Name: Java 5
Description: 


****************************************************************************
Test Summary:
****************************************************************************
Tests: 330
Failures: 1
Total time: 9009

****************************************************************************
Output:
****************************************************************************
[INFO] Scanning for projects...
[INFO] Reactor build order: 
[INFO]   HttpComponents Client
[INFO]   HttpClient (base module)
[INFO]   HttpClient (MIME entities)
[INFO] Searching repository for plugin with prefix: 'assembly'.
[INFO] ----------------------------------------------------------------------------
[INFO] Building HttpComponents Client
[INFO]    task-segment: [clean, package]
[INFO] ----------------------------------------------------------------------------
[INFO] [clean:clean]
[INFO] Deleting directory /home/continuum/data/working-directory/353/target
[INFO] Deleting directory /home/continuum/data/working-directory/353/target/classes
[INFO] Deleting directory /home/continuum/data/working-directory/353/target/test-classes
[INFO] Deleting directory /home/continuum/data/working-directory/353/target/site
[INFO] [site:attach-descriptor]
[WARNING] Unable to load parent project from repository: Could not find the model file '/home/continuum/data/working-directory/353/../project/pom.xml'.
for project unknown
[INFO] ----------------------------------------------------------------------------
[INFO] Building HttpClient (base module)
[INFO]    task-segment: [clean, package]
[INFO] ----------------------------------------------------------------------------
[INFO] [clean:clean]
[INFO] Deleting directory /home/continuum/data/working-directory/353/module-client/target
[INFO] Deleting directory /home/continuum/data/working-directory/353/module-client/target/classes
[INFO] Deleting directory /home/continuum/data/working-directory/353/module-client/target/test-classes
[INFO] Deleting directory /home/continuum/data/working-directory/353/module-client/target/site
[INFO] [resources:resources]
[INFO] Using default encoding to copy filtered resources.
[INFO] [compiler:compile]
[INFO] Compiling 175 source files to /home/continuum/data/working-directory/353/module-client/target/classes
[INFO] [resources:testResources]
[INFO] Using default encoding to copy filtered resources.
[INFO] [compiler:testCompile]
[INFO] Compiling 69 source files to /home/continuum/data/working-directory/353/module-client/target/test-classes
[INFO] [surefire:test]
[INFO] Surefire report directory: /home/continuum/data/working-directory/353/module-client/target/surefire-reports

-------------------------------------------------------
 T E S T S
-------------------------------------------------------
Running org.apache.http.client.TestAll
Tests run: 320, Failures: 0, Errors: 0, Skipped: 0, Time elapsed: 8.215 sec

Results :

Tests run: 320, Failures: 0, Errors: 0, Skipped: 0

[INFO] [jar:jar]
[INFO] Building jar: /home/continuum/data/working-directory/353/module-client/target/httpclient-4.0-alpha3-SNAPSHOT.jar
[INFO] ----------------------------------------------------------------------------
[INFO] Building HttpClient (MIME entities)
[INFO]    task-segment: [clean, package]
[INFO] ----------------------------------------------------------------------------
[INFO] [clean:clean]
[INFO] Deleting directory /home/continuum/data/working-directory/353/module-httpmime/target
[INFO] Deleting directory /home/continuum/data/working-directory/353/module-httpmime/target/classes
[INFO] Deleting directory /home/continuum/data/working-directory/353/module-httpmime/target/test-classes
[INFO] Deleting directory /home/continuum/data/working-directory/353/module-httpmime/target/site
[INFO] [resources:resources]
[INFO] Using default encoding to copy filtered resources.
[INFO] [compiler:compile]
[INFO] Compiling 11 source files to /home/continuum/data/working-directory/353/module-httpmime/target/classes
[INFO] [resources:testResources]
[INFO] Using default encoding to copy filtered resources.
[INFO] [compiler:testCompile]
[INFO] Compiling 3 source files to /home/continuum/data/working-directory/353/module-httpmime/target/test-classes
[INFO] [surefire:test]
[INFO] Surefire report directory: /home/continuum/data/working-directory/353/module-httpmime/target/surefire-reports

-------------------------------------------------------
 T E S T S
-------------------------------------------------------
Running org.apache.http.entity.mime.TestAll
log4j:WARN No appenders could be found for logger (org.apache.james.mime4j.util.CharsetUtil).
log4j:WARN Please initialize the log4j system properly.
Tests run: 10, Failures: 1, Errors: 0, Skipped: 0, Time elapsed: 0.863 sec <<< FAILURE!

Results :

Failed tests: 
  testMultipartFormStringParts(org.apache.http.entity.mime.TestMultipartForm)

Tests run: 10, Failures: 1, Errors: 0, Skipped: 0

[INFO] ------------------------------------------------------------------------
[ERROR] BUILD FAILURE
[INFO] ------------------------------------------------------------------------
[INFO] There are test failures.
[INFO] ------------------------------------------------------------------------
[INFO] For more information, run Maven with the -e switch
[INFO] ------------------------------------------------------------------------
[INFO] Total time: 49 seconds
[INFO] Finished at: Sun Feb 17 09:04:51 PST 2008
[INFO] Final Memory: 11M/29M
[INFO] ------------------------------------------------------------------------

****************************************************************************



Mime
View raw message