hbase-user mailing list archives

Site index · List index
Message view « Date » · « Thread »
Top « Date » · « Thread »
From hua xiang <adam_...@yahoo.com>
Subject error when installing thrift
Date Tue, 23 Oct 2012 08:25:11 GMT
Hi, 

   below is the 'make check' error messages when installing thrift 0.9 on redhat 6.1system.



PASS: testthrifttestclient
====================
1 of 11 tests failed
====================
make[5]: *** [check-TESTS] error  1
make[5]: Leaving directory `/hadoop0/thrift-0.9.0/lib/c_glib/test'
make[4]: *** [check-am] error 2
make[4]: Leaving directory `/hadoop0/thrift-0.9.0/lib/c_glib/test'
make[3]: *** [check-recursive]  error 1
make[3]: Leaving directory `/hadoop0/thrift-0.9.0/lib/c_glib/test'
make[2]: *** [check-recursive]  error 1
make[2]: Leaving directory `/hadoop0/thrift-0.9.0/lib/c_glib'
make[1]: *** [check-recursive]  error 1
make[1]: Leaving directory `/hadoop0/thrift-0.9.0/lib'
make: *** [check-recursive]  error 1
[root@hadoop2 thrift-0.9.

beatls

Mime
  • Unnamed multipart/alternative (inline, None, 0 bytes)
View raw message