hbase-issues mailing list archives

Site index · List index
Message view « Date » · « Thread »
Top « Date » · « Thread »
From "Hudson (JIRA)" <j...@apache.org>
Subject [jira] [Commented] (HBASE-19906) TestZooKeeper Timeout
Date Fri, 02 Feb 2018 00:22:00 GMT

    [ https://issues.apache.org/jira/browse/HBASE-19906?page=com.atlassian.jira.plugin.system.issuetabpanels:comment-tabpanel&focusedCommentId=16349566#comment-16349566
] 

Hudson commented on HBASE-19906:
--------------------------------

FAILURE: Integrated in Jenkins build HBase-Trunk_matrix #4510 (See [https://builds.apache.org/job/HBase-Trunk_matrix/4510/])
HBASE-19906 TestZooKeeper Timeout Includes move of TestQoSFunction from (stack: rev b21b8bfb91662bc65327f924504975997e0946da)
* (edit) hbase-server/src/main/java/org/apache/hadoop/hbase/master/HMaster.java
* (edit) hbase-server/src/main/java/org/apache/hadoop/hbase/master/assignment/AssignmentManager.java
* (edit) hbase-server/src/test/java/org/apache/hadoop/hbase/regionserver/TestQosFunction.java


> TestZooKeeper Timeout
> ---------------------
>
>                 Key: HBASE-19906
>                 URL: https://issues.apache.org/jira/browse/HBASE-19906
>             Project: HBase
>          Issue Type: Bug
>            Reporter: stack
>            Assignee: stack
>            Priority: Major
>             Fix For: 2.0.0-beta-2
>
>         Attachments: HBASE-19906.branch-2.001.patch, HBASE-19906.branch-2.002.patch,
HBASE-19906.branch-2.003.patch, HBASE-19906.branch-2.003.patch, HBASE-19906.branch-2.004.patch,
HBASE-19906.branch-2.005.patch, HBASE-19906.branch-2.005.patch
>
>
> TestZooKeeper is timing out causing hbase2 failures and breaking HBASE-Flaky-Tests-branch2.0.0.
> -------------------------------------------------------------------------------
> Test set: org.apache.hadoop.hbase.TestZooKeeper
> -------------------------------------------------------------------------------
> Tests run: 6, Failures: 0, Errors: 2, Skipped: 0, Time elapsed: 600.8 s <<<
FAILURE! - in org.apache.hadoop.hbase.TestZooKeeper
> org.apache.hadoop.hbase.TestZooKeeper  Time elapsed: 551.041 s  <<< ERROR!
> org.junit.runners.model.TestTimedOutException: test timed out after 600 seconds
> 	at org.apache.hadoop.hbase.TestZooKeeper.after(TestZooKeeper.java:103)
> org.apache.hadoop.hbase.TestZooKeeper  Time elapsed: 551.046 s  <<< ERROR!
> java.lang.Exception: Appears to be stuck in thread NIOServerCxn.Factory:0.0.0.0/0.0.0.0:59935
> Not always though.



--
This message was sent by Atlassian JIRA
(v7.6.3#76005)

Mime
View raw message