hbase-issues mailing list archives

Site index · List index
Message view « Date » · « Thread »
Top « Date » · « Thread »
From "Hudson (JIRA)" <j...@apache.org>
Subject [jira] [Commented] (HBASE-19666) TestDefaultCompactSelection test failed
Date Wed, 03 Jan 2018 13:50:00 GMT

    [ https://issues.apache.org/jira/browse/HBASE-19666?page=com.atlassian.jira.plugin.system.issuetabpanels:comment-tabpanel&focusedCommentId=16309666#comment-16309666
] 

Hudson commented on HBASE-19666:
--------------------------------

FAILURE: Integrated in Jenkins build HBase-Trunk_matrix #4336 (See [https://builds.apache.org/job/HBase-Trunk_matrix/4336/])
HBASE-19666 TestDefaultCompactSelection test failed (chia7712: rev d84c4ec29f1552581fdafbd08defd5b56e983c23)
* (edit) hbase-server/src/test/java/org/apache/hadoop/hbase/regionserver/TestDefaultCompactSelection.java


> TestDefaultCompactSelection test failed
> ---------------------------------------
>
>                 Key: HBASE-19666
>                 URL: https://issues.apache.org/jira/browse/HBASE-19666
>             Project: HBase
>          Issue Type: Bug
>          Components: test
>    Affects Versions: 2.0
>            Reporter: Jingyun Tian
>            Assignee: Balazs Meszaros
>            Priority: Critical
>             Fix For: 2.0.0-beta-2
>
>         Attachments: HBASE-19666.v0.patch
>
>
> hadoop.hbase.regionserver.TestDefaultCompactSelection
> [ERROR] Failures: 
> [ERROR]   TestDefaultCompactSelection.testCompactionRatio:74->TestCompactionPolicy.compactEquals:182->TestCompactionPolicy.compactEquals:201
expected:<[[4, 2, 1]]> but was:<[[]]>
> [ERROR]   TestDefaultCompactSelection.testStuckStoreCompaction:145->TestCompactionPolicy.compactEquals:182->TestCompactionPolicy.compactEquals:201
expected:<[[]30, 30, 30]> but was:<[[99, 30, ]30, 30, 30]>



--
This message was sent by Atlassian JIRA
(v6.4.14#64029)

Mime
View raw message