hbase-issues mailing list archives

Site index · List index
Message view « Date » · « Thread »
Top « Date » · « Thread »
From "Jingyun Tian (JIRA)" <j...@apache.org>
Subject [jira] [Created] (HBASE-19666) hadoop.hbase.regionserver.TestDefaultCompactSelection test failed
Date Fri, 29 Dec 2017 09:56:00 GMT
Jingyun Tian created HBASE-19666:
------------------------------------

             Summary: hadoop.hbase.regionserver.TestDefaultCompactSelection test failed
                 Key: HBASE-19666
                 URL: https://issues.apache.org/jira/browse/HBASE-19666
             Project: HBase
          Issue Type: Bug
    Affects Versions: 2.0
            Reporter: Jingyun Tian
            Priority: Critical


hadoop.hbase.regionserver.TestDefaultCompactSelection
[ERROR] Failures: 
[ERROR]   TestDefaultCompactSelection.testCompactionRatio:74->TestCompactionPolicy.compactEquals:182->TestCompactionPolicy.compactEquals:201
expected:<[[4, 2, 1]]> but was:<[[]]>
[ERROR]   TestDefaultCompactSelection.testStuckStoreCompaction:145->TestCompactionPolicy.compactEquals:182->TestCompactionPolicy.compactEquals:201
expected:<[[]30, 30, 30]> but was:<[[99, 30, ]30, 30, 30]>




--
This message was sent by Atlassian JIRA
(v6.4.14#64029)

Mime
View raw message