hbase-issues mailing list archives

Site index · List index
Message view « Date » · « Thread »
Top « Date » · « Thread »
From "Hadoop QA (JIRA)" <j...@apache.org>
Subject [jira] [Commented] (HBASE-19395) [branch-1] TestEndToEndSplitTransaction.testMasterOpsWhileSplitting fails with NPE
Date Sat, 02 Dec 2017 01:59:00 GMT

    [ https://issues.apache.org/jira/browse/HBASE-19395?page=com.atlassian.jira.plugin.system.issuetabpanels:comment-tabpanel&focusedCommentId=16275364#comment-16275364
] 

Hadoop QA commented on HBASE-19395:
-----------------------------------

| (x) *{color:red}-1 overall{color}* |
\\
\\
|| Vote || Subsystem || Runtime || Comment ||
| {color:blue}0{color} | {color:blue} reexec {color} | {color:blue}  0m 12s{color} | {color:blue}
Docker mode activated. {color} |
|| || || || {color:brown} Prechecks {color} ||
| {color:green}+1{color} | {color:green} hbaseanti {color} | {color:green}  0m  0s{color}
| {color:green} Patch does not have any anti-patterns. {color} |
| {color:green}+1{color} | {color:green} @author {color} | {color:green}  0m  0s{color} |
{color:green} The patch does not contain any @author tags. {color} |
| {color:red}-1{color} | {color:red} test4tests {color} | {color:red}  0m  0s{color} | {color:red}
The patch doesn't appear to include any new or modified tests. Please justify why no new tests
are needed for this patch. Also please list what manual steps were performed to verify this
patch. {color} |
|| || || || {color:brown} branch-1 Compile Tests {color} ||
| {color:green}+1{color} | {color:green} mvninstall {color} | {color:green}  1m 53s{color}
| {color:green} branch-1 passed {color} |
| {color:green}+1{color} | {color:green} compile {color} | {color:green}  0m 33s{color} |
{color:green} branch-1 passed with JDK v1.8.0_152 {color} |
| {color:green}+1{color} | {color:green} compile {color} | {color:green}  0m 38s{color} |
{color:green} branch-1 passed with JDK v1.7.0_161 {color} |
| {color:green}+1{color} | {color:green} checkstyle {color} | {color:green}  1m 17s{color}
| {color:green} branch-1 passed {color} |
| {color:green}+1{color} | {color:green} shadedjars {color} | {color:green}  3m 54s{color}
| {color:green} branch has no errors when building our shaded downstream artifacts. {color}
|
| {color:red}-1{color} | {color:red} findbugs {color} | {color:red}  2m 19s{color} | {color:red}
hbase-server in branch-1 has 1 extant Findbugs warnings. {color} |
| {color:green}+1{color} | {color:green} javadoc {color} | {color:green}  0m 28s{color} |
{color:green} branch-1 passed with JDK v1.8.0_152 {color} |
| {color:green}+1{color} | {color:green} javadoc {color} | {color:green}  0m 34s{color} |
{color:green} branch-1 passed with JDK v1.7.0_161 {color} |
|| || || || {color:brown} Patch Compile Tests {color} ||
| {color:green}+1{color} | {color:green} mvninstall {color} | {color:green}  1m 52s{color}
| {color:green} the patch passed {color} |
| {color:green}+1{color} | {color:green} compile {color} | {color:green}  0m 33s{color} |
{color:green} the patch passed with JDK v1.8.0_152 {color} |
| {color:green}+1{color} | {color:green} javac {color} | {color:green}  0m 33s{color} | {color:green}
the patch passed {color} |
| {color:green}+1{color} | {color:green} compile {color} | {color:green}  0m 37s{color} |
{color:green} the patch passed with JDK v1.7.0_161 {color} |
| {color:green}+1{color} | {color:green} javac {color} | {color:green}  0m 38s{color} | {color:green}
the patch passed {color} |
| {color:green}+1{color} | {color:green} checkstyle {color} | {color:green}  1m 18s{color}
| {color:green} the patch passed {color} |
| {color:green}+1{color} | {color:green} whitespace {color} | {color:green}  0m  0s{color}
| {color:green} The patch has no whitespace issues. {color} |
| {color:green}+1{color} | {color:green} shadedjars {color} | {color:green}  2m 38s{color}
| {color:green} patch has no errors when building our shaded downstream artifacts. {color}
|
| {color:green}+1{color} | {color:green} hadoopcheck {color} | {color:green} 29m  7s{color}
| {color:green} Patch does not cause any errors with Hadoop 2.4.0 2.4.1 2.5.0 2.5.1 2.5.2
2.6.1 2.6.2 2.6.3 2.6.4 2.6.5 2.7.1 2.7.2 2.7.3 2.7.4. {color} |
| {color:green}+1{color} | {color:green} findbugs {color} | {color:green}  2m 40s{color} |
{color:green} the patch passed {color} |
| {color:green}+1{color} | {color:green} javadoc {color} | {color:green}  0m 29s{color} |
{color:green} the patch passed with JDK v1.8.0_152 {color} |
| {color:green}+1{color} | {color:green} javadoc {color} | {color:green}  0m 37s{color} |
{color:green} the patch passed with JDK v1.7.0_161 {color} |
|| || || || {color:brown} Other Tests {color} ||
| {color:green}+1{color} | {color:green} unit {color} | {color:green} 89m 14s{color} | {color:green}
hbase-server in the patch passed. {color} |
| {color:green}+1{color} | {color:green} asflicense {color} | {color:green}  0m 16s{color}
| {color:green} The patch does not generate ASF License warnings. {color} |
| {color:black}{color} | {color:black} {color} | {color:black}137m 43s{color} | {color:black}
{color} |
\\
\\
|| Subsystem || Report/Notes ||
| Docker | Client=17.05.0-ce Server=17.05.0-ce Image:yetus/hbase:36a7029 |
| JIRA Issue | HBASE-19395 |
| JIRA Patch URL | https://issues.apache.org/jira/secure/attachment/12900307/HBASE-19395-branch-1.patch
|
| Optional Tests |  asflicense  javac  javadoc  unit  findbugs  shadedjars  hadoopcheck  hbaseanti
 checkstyle  compile  |
| uname | Linux aa8bf4ee59cf 3.13.0-133-generic #182-Ubuntu SMP Tue Sep 19 15:49:21 UTC 2017
x86_64 x86_64 x86_64 GNU/Linux |
| Build tool | maven |
| Personality | /home/jenkins/jenkins-slave/workspace/PreCommit-HBASE-Build/component/dev-support/hbase-personality.sh
|
| git revision | branch-1 / 6938720 |
| maven | version: Apache Maven 3.0.5 |
| Default Java | 1.7.0_161 |
| Multi-JDK versions |  /usr/lib/jvm/java-8-openjdk-amd64:1.8.0_152 /usr/lib/jvm/java-7-openjdk-amd64:1.7.0_161
|
| findbugs | v3.0.0 |
| findbugs | https://builds.apache.org/job/PreCommit-HBASE-Build/10191/artifact/patchprocess/branch-findbugs-hbase-server-warnings.html
|
|  Test Results | https://builds.apache.org/job/PreCommit-HBASE-Build/10191/testReport/ |
| modules | C: hbase-server U: hbase-server |
| Console output | https://builds.apache.org/job/PreCommit-HBASE-Build/10191/console |
| Powered by | Apache Yetus 0.6.0   http://yetus.apache.org |


This message was automatically generated.



> [branch-1] TestEndToEndSplitTransaction.testMasterOpsWhileSplitting fails with NPE
> ----------------------------------------------------------------------------------
>
>                 Key: HBASE-19395
>                 URL: https://issues.apache.org/jira/browse/HBASE-19395
>             Project: HBase
>          Issue Type: Bug
>            Reporter: Guanghao Zhang
>            Assignee: Andrew Purtell
>            Priority: Trivial
>             Fix For: 1.4.0
>
>         Attachments: HBASE-19395-branch-1.patch
>
>
> [INFO] Running org.apache.hadoop.hbase.regionserver.TestEndToEndSplitTransaction
> [ERROR] Tests run: 3, Failures: 0, Errors: 1, Skipped: 0, Time elapsed: 50.388 s <<<
FAILURE! - in org.apache.hadoop.hbase.regionserver.TestEndToEndSplitTransaction
> [ERROR] testMasterOpsWhileSplitting(org.apache.hadoop.hbase.regionserver.TestEndToEndSplitTransaction)
 Time elapsed: 8.903 s  <<< ERROR!
> java.lang.NullPointerException
> 	at org.apache.hadoop.hbase.regionserver.TestEndToEndSplitTransaction.test(TestEndToEndSplitTransaction.java:239)
> 	at org.apache.hadoop.hbase.regionserver.TestEndToEndSplitTransaction.testMasterOpsWhileSplitting(TestEndToEndSplitTransaction.java:148)



--
This message was sent by Atlassian JIRA
(v6.4.14#64029)

Mime
View raw message