hbase-issues mailing list archives

Site index · List index
Message view « Date » · « Thread »
Top « Date » · « Thread »
From "Hudson (JIRA)" <j...@apache.org>
Subject [jira] [Commented] (HBASE-19288) Intermittent test failure in TestHStore.testRunDoubleMemStoreCompactors
Date Mon, 20 Nov 2017 09:39:00 GMT

    [ https://issues.apache.org/jira/browse/HBASE-19288?page=com.atlassian.jira.plugin.system.issuetabpanels:comment-tabpanel&focusedCommentId=16259020#comment-16259020
] 

Hudson commented on HBASE-19288:
--------------------------------

SUCCESS: Integrated in Jenkins build HBase-Trunk_matrix #4085 (See [https://builds.apache.org/job/HBase-Trunk_matrix/4085/])
HBASE-19288 Intermittent test failure in (tedyu: rev 9b7b83d86208c30dbb83ea717e694c5389e71671)
* (edit) hbase-server/src/test/java/org/apache/hadoop/hbase/regionserver/TestHStore.java
* (edit) hbase-server/src/main/java/org/apache/hadoop/hbase/regionserver/CompactingMemStore.java


> Intermittent test failure in TestHStore.testRunDoubleMemStoreCompactors
> -----------------------------------------------------------------------
>
>                 Key: HBASE-19288
>                 URL: https://issues.apache.org/jira/browse/HBASE-19288
>             Project: HBase
>          Issue Type: Test
>          Components: test
>            Reporter: Ted Yu
>            Assignee: Ted Yu
>             Fix For: 2.0.0-beta-1
>
>         Attachments: 19288.v1.txt, 19288.v2.txt, testRunDoubleMemStoreCompactors.out
>
>
> Here was one of the test failures: https://builds.apache.org/job/PreCommit-HBASE-Build/9812/testReport/junit/org.apache.hadoop.hbase.regionserver/TestHStore/testRunDoubleMemStoreCompactors/

> {code}
> [ERROR] org.apache.hadoop.hbase.regionserver.TestHStore.testRunDoubleMemStoreCompactors(org.apache.hadoop.hbase.regionserver.TestHStore)
> [ERROR]   Run 1: TestHStore.testRunDoubleMemStoreCompactors:1500 expected:<2> but
was:<3>
> [ERROR]   Run 2: TestHStore.testRunDoubleMemStoreCompactors:1481 expected:<1> but
was:<4>
> [ERROR]   Run 3: TestHStore.testRunDoubleMemStoreCompactors:1481 expected:<1> but
was:<5>
> {code}
> From the counts for second and third runs, we know that RUNNER_COUNT was not cleared
in between the reruns, leading to failure at the 1st assertion.



--
This message was sent by Atlassian JIRA
(v6.4.14#64029)

Mime
View raw message