hbase-issues mailing list archives

Site index · List index
Message view « Date » · « Thread »
Top « Date » · « Thread »
From "Ted Yu (JIRA)" <j...@apache.org>
Subject [jira] [Updated] (HBASE-19288) Intermittent test failure in TestHStore.testRunDoubleMemStoreCompactors
Date Thu, 16 Nov 2017 22:33:00 GMT

     [ https://issues.apache.org/jira/browse/HBASE-19288?page=com.atlassian.jira.plugin.system.issuetabpanels:all-tabpanel
]

Ted Yu updated HBASE-19288:
---------------------------
    Attachment: testRunDoubleMemStoreCompactors.out

> Intermittent test failure in TestHStore.testRunDoubleMemStoreCompactors
> -----------------------------------------------------------------------
>
>                 Key: HBASE-19288
>                 URL: https://issues.apache.org/jira/browse/HBASE-19288
>             Project: HBase
>          Issue Type: Test
>            Reporter: Ted Yu
>         Attachments: testRunDoubleMemStoreCompactors.out
>
>
> Here was one of the test failures: https://builds.apache.org/job/PreCommit-HBASE-Build/9812/testReport/junit/org.apache.hadoop.hbase.regionserver/TestHStore/testRunDoubleMemStoreCompactors/

> {code}
> [ERROR] org.apache.hadoop.hbase.regionserver.TestHStore.testRunDoubleMemStoreCompactors(org.apache.hadoop.hbase.regionserver.TestHStore)
> [ERROR]   Run 1: TestHStore.testRunDoubleMemStoreCompactors:1500 expected:<2> but
was:<3>
> [ERROR]   Run 2: TestHStore.testRunDoubleMemStoreCompactors:1481 expected:<1> but
was:<4>
> [ERROR]   Run 3: TestHStore.testRunDoubleMemStoreCompactors:1481 expected:<1> but
was:<5>
> {code}
> From the counts for second and third runs, we know that RUNNER_COUNT was not cleared
in between the reruns, leading to failure at the 1st assertion.



--
This message was sent by Atlassian JIRA
(v6.4.14#64029)

Mime
View raw message