hbase-issues mailing list archives

Site index · List index
Message view « Date » · « Thread »
Top « Date » · « Thread »
From "Hudson (JIRA)" <j...@apache.org>
Subject [jira] [Commented] (HBASE-17703) TestThriftServerCmdLine is flaky in master branch
Date Mon, 06 Nov 2017 04:03:01 GMT

    [ https://issues.apache.org/jira/browse/HBASE-17703?page=com.atlassian.jira.plugin.system.issuetabpanels:comment-tabpanel&focusedCommentId=16239871#comment-16239871
] 

Hudson commented on HBASE-17703:
--------------------------------

FAILURE: Integrated in Jenkins build HBase-1.3-JDK8 #352 (See [https://builds.apache.org/job/HBase-1.3-JDK8/352/])
HBASE-18996 Backport HBASE-17703 (TestThriftServerCmdLine is flaky in (chia7712: rev df419a16881c0efc434ab28e981d66fd1ade5353)
* (edit) hbase-thrift/src/test/java/org/apache/hadoop/hbase/thrift/TestThriftServerCmdLine.java


> TestThriftServerCmdLine is flaky in master branch
> -------------------------------------------------
>
>                 Key: HBASE-17703
>                 URL: https://issues.apache.org/jira/browse/HBASE-17703
>             Project: HBase
>          Issue Type: Test
>            Reporter: Ted Yu
>            Assignee: Jan Hentschel
>             Fix For: 2.0.0
>
>         Attachments: HBASE-17703.master.001.patch
>
>
> According to https://builds.apache.org/job/HBASE-Find-Flaky-Tests/lastSuccessfulBuild/artifact/dashboard.html
, TestThriftServerCmdLine is the top flaky test.
> It fails in QA run sometimes.
> https://builds.apache.org/job/PreCommit-HBASE-Build/5848/artifact/patchprocess/patch-unit-hbase-thrift.txt
> {code}
> testRunThriftServer[0](org.apache.hadoop.hbase.thrift.TestThriftServerCmdLine)  Time
elapsed: 10.057 sec  <<< ERROR!
> java.lang.NullPointerException: null
> 	at org.apache.hadoop.hbase.thrift.TestThriftServerCmdLine.testRunThriftServer(TestThriftServerCmdLine.java:187)
> Tests run: 1, Failures: 1, Errors: 0, Skipped: 0, Time elapsed: 60.212 sec <<<
FAILURE! - in org.apache.hadoop.hbase.thrift.TestThriftServerCmdLine
> testRunThriftServer[0](org.apache.hadoop.hbase.thrift.TestThriftServerCmdLine)  Time
elapsed: 0.166 sec  <<< FAILURE!
> java.lang.AssertionError: null
> 	at org.junit.Assert.fail(Assert.java:86)
> 	at org.junit.Assert.assertTrue(Assert.java:41)
> 	at org.junit.Assert.assertTrue(Assert.java:52)
> 	at org.apache.hadoop.hbase.thrift.TestThriftServer.checkTableList(TestThriftServer.java:254)
> 	at org.apache.hadoop.hbase.thrift.TestThriftServerCmdLine.talkToThriftServer(TestThriftServerCmdLine.java:227)
> 	at org.apache.hadoop.hbase.thrift.TestThriftServerCmdLine.testRunThriftServer(TestThriftServerCmdLine.java:190)
> Tests run: 1, Failures: 1, Errors: 0, Skipped: 0, Time elapsed: 64.428 sec <<<
FAILURE! - in org.apache.hadoop.hbase.thrift.TestThriftServerCmdLine
> testRunThriftServer[0](org.apache.hadoop.hbase.thrift.TestThriftServerCmdLine)  Time
elapsed: 0.144 sec  <<< FAILURE!
> java.lang.AssertionError: null
> 	at org.junit.Assert.fail(Assert.java:86)
> 	at org.junit.Assert.assertTrue(Assert.java:41)
> 	at org.junit.Assert.assertTrue(Assert.java:52)
> 	at org.apache.hadoop.hbase.thrift.TestThriftServer.checkTableList(TestThriftServer.java:254)
> 	at org.apache.hadoop.hbase.thrift.TestThriftServerCmdLine.talkToThriftServer(TestThriftServerCmdLine.java:227)
> 	at org.apache.hadoop.hbase.thrift.TestThriftServerCmdLine.testRunThriftServer(TestThriftServerCmdLine.java:190)
> {code}



--
This message was sent by Atlassian JIRA
(v6.4.14#64029)

Mime
View raw message