hbase-issues mailing list archives

Site index · List index
Message view « Date » · « Thread »
Top « Date » · « Thread »
From "Mohammad Arshad (JIRA)" <j...@apache.org>
Subject [jira] [Updated] (HBASE-17079) HBase build fails on windows, hbase-archetype-builder is reason for failure
Date Mon, 06 Nov 2017 15:21:00 GMT

     [ https://issues.apache.org/jira/browse/HBASE-17079?page=com.atlassian.jira.plugin.system.issuetabpanels:all-tabpanel
]

Mohammad Arshad updated HBASE-17079:
------------------------------------
    Status: Patch Available  (was: Open)

> HBase build fails on windows, hbase-archetype-builder is reason for failure
> ---------------------------------------------------------------------------
>
>                 Key: HBASE-17079
>                 URL: https://issues.apache.org/jira/browse/HBASE-17079
>             Project: HBase
>          Issue Type: Bug
>          Components: build
>         Environment: windows
>            Reporter: Mohammad Arshad
>             Fix For: 2.0.0, 1.4.0, 1.3.2
>
>         Attachments: HBASE-17079.branch-1.3.002.patch, HBASE-17079.branch-1.3.Verification.jpg,
HBASE-17079.master.001.patch, HBASE-17079.master.002.patch, screenshot-1.png
>
>
> HBase buid fails on windows, hbase-archetype-builder is reason for failure. Cygwin is
installed so the shell scripts should execute successfully.
> Here is build failure log
> {code}
> [INFO] Apache HBase - Archetype builder ................... FAILURE [  1.014 s]
> [INFO] ------------------------------------------------------------------------
> [INFO] BUILD FAILURE
> [INFO] ------------------------------------------------------------------------
> [INFO] Total time: 06:13 min
> [INFO] Finished at: 2016-11-12T18:12:26+05:30
> [INFO] Final Memory: 235M/1012M
> [INFO] ------------------------------------------------------------------------
> [ERROR] Failed to execute goal org.codehaus.mojo:exec-maven-plugin:1.4.0:exec (make-scripts-executable)
on project hbase-archetype-builder: Command execution failed. Process exited with an error:
1 (Exit value: 1) -> [Help 1]
> [ERROR]
> [ERROR] To see the full stack trace of the errors, re-run Maven with the -e switch.
> [ERROR] Re-run Maven using the -X switch to enable full debug logging.
> [ERROR]
> [ERROR] For more information about the errors and possible solutions, please read the
following articles:
> [ERROR] [Help 1] http://cwiki.apache.org/confluence/display/MAVEN/MojoExecutionException
> [ERROR]
> [ERROR] After correcting the problems, you can resume the build with the command
> [ERROR]   mvn <goals> -rf :hbase-archetype-builder
> {code}



--
This message was sent by Atlassian JIRA
(v6.4.14#64029)

Mime
View raw message