hbase-issues mailing list archives

Site index · List index
Message view « Date » · « Thread »
Top « Date » · « Thread »
From "Andrew Purtell (JIRA)" <j...@apache.org>
Subject [jira] [Created] (HBASE-19129) TestChoreService is flaky (branch-1 / branch-1.4)
Date Tue, 31 Oct 2017 00:09:01 GMT
Andrew Purtell created HBASE-19129:
--------------------------------------

             Summary: TestChoreService is flaky (branch-1 / branch-1.4)
                 Key: HBASE-19129
                 URL: https://issues.apache.org/jira/browse/HBASE-19129
             Project: HBase
          Issue Type: Bug
            Reporter: Andrew Purtell
            Assignee: Andrew Purtell
            Priority: Minor
             Fix For: 2.0.0, 3.0.0, 1.4.0, 1.5.0


Rare flake. 

[ERROR] Tests run: 17, Failures: 1, Errors: 0, Skipped: 0, Time elapsed: 21.788 s <<<
FAILURE! - in org.apache.hadoop.hbase.TestChoreService
[ERROR] testForceTrigger(org.apache.hadoop.hbase.TestChoreService) Time elapsed: 1.044 s <<<
FAILURE!
java.lang.AssertionError
at org.apache.hadoop.hbase.TestChoreService.testForceTrigger(TestChoreService.java:381)

Increase the delta to compensate for environmental variance.



--
This message was sent by Atlassian JIRA
(v6.4.14#64029)

Mime
View raw message