hbase-issues mailing list archives

Site index · List index
Message view « Date » · « Thread »
Top « Date » · « Thread »
From "Hadoop QA (JIRA)" <j...@apache.org>
Subject [jira] [Commented] (HBASE-19019) QA fails on hbase-thrift module with timeout
Date Sat, 21 Oct 2017 16:28:00 GMT

    [ https://issues.apache.org/jira/browse/HBASE-19019?page=com.atlassian.jira.plugin.system.issuetabpanels:comment-tabpanel&focusedCommentId=16214014#comment-16214014
] 

Hadoop QA commented on HBASE-19019:
-----------------------------------

| (/) *{color:green}+1 overall{color}* |
\\
\\
|| Vote || Subsystem || Runtime || Comment ||
| {color:blue}0{color} | {color:blue} reexec {color} | {color:blue} 14m 54s{color} | {color:blue}
Docker mode activated. {color} |
| {color:green}+1{color} | {color:green} hbaseanti {color} | {color:green}  0m  0s{color}
| {color:green} Patch does not have any anti-patterns. {color} |
| {color:green}+1{color} | {color:green} @author {color} | {color:green}  0m  0s{color} |
{color:green} The patch does not contain any @author tags. {color} |
| {color:green}+1{color} | {color:green} test4tests {color} | {color:green}  0m  0s{color}
| {color:green} The patch appears to include 1 new or modified test files. {color} |
| {color:green}+1{color} | {color:green} mvninstall {color} | {color:green}  1m 55s{color}
| {color:green} branch-1 passed {color} |
| {color:green}+1{color} | {color:green} compile {color} | {color:green}  0m 23s{color} |
{color:green} branch-1 passed {color} |
| {color:green}+1{color} | {color:green} checkstyle {color} | {color:green}  0m 23s{color}
| {color:green} branch-1 passed {color} |
| {color:green}+1{color} | {color:green} mvneclipse {color} | {color:green}  0m 17s{color}
| {color:green} branch-1 passed {color} |
| {color:green}+1{color} | {color:green} shadedjars {color} | {color:green}  3m  3s{color}
| {color:green} branch has no errors when building our shaded downstream artifacts. {color}
|
| {color:green}+1{color} | {color:green} findbugs {color} | {color:green}  1m 11s{color} |
{color:green} branch-1 passed {color} |
| {color:green}+1{color} | {color:green} javadoc {color} | {color:green}  0m 40s{color} |
{color:green} branch-1 passed {color} |
| {color:green}+1{color} | {color:green} mvninstall {color} | {color:green}  1m 46s{color}
| {color:green} the patch passed {color} |
| {color:green}+1{color} | {color:green} compile {color} | {color:green}  0m 22s{color} |
{color:green} the patch passed {color} |
| {color:green}+1{color} | {color:green} javac {color} | {color:green}  0m 22s{color} | {color:green}
the patch passed {color} |
| {color:green}+1{color} | {color:green} checkstyle {color} | {color:green}  0m 23s{color}
| {color:green} the patch passed {color} |
| {color:green}+1{color} | {color:green} mvneclipse {color} | {color:green}  0m 15s{color}
| {color:green} the patch passed {color} |
| {color:green}+1{color} | {color:green} whitespace {color} | {color:green}  0m  0s{color}
| {color:green} The patch has no whitespace issues. {color} |
| {color:green}+1{color} | {color:green} shadedjars {color} | {color:green}  2m 22s{color}
| {color:green} patch has no errors when building our shaded downstream artifacts. {color}
|
| {color:green}+1{color} | {color:green} hadoopcheck {color} | {color:green} 25m 23s{color}
| {color:green} Patch does not cause any errors with Hadoop 2.4.0 2.4.1 2.5.0 2.5.1 2.5.2
2.6.1 2.6.2 2.6.3 2.6.4 2.6.5 2.7.1 2.7.2 2.7.3. {color} |
| {color:green}+1{color} | {color:green} findbugs {color} | {color:green}  1m 25s{color} |
{color:green} the patch passed {color} |
| {color:green}+1{color} | {color:green} javadoc {color} | {color:green}  0m 40s{color} |
{color:green} the patch passed {color} |
| {color:green}+1{color} | {color:green} unit {color} | {color:green}  3m 29s{color} | {color:green}
hbase-thrift in the patch passed. {color} |
| {color:green}+1{color} | {color:green} asflicense {color} | {color:green}  0m  8s{color}
| {color:green} The patch does not generate ASF License warnings. {color} |
| {color:black}{color} | {color:black} {color} | {color:black} 56m 25s{color} | {color:black}
{color} |
\\
\\
|| Subsystem || Report/Notes ||
| Docker | Client=17.05.0-ce Server=17.05.0-ce Image:yetus/hbase:4bf71c3 |
| JIRA Issue | HBASE-19019 |
| JIRA Patch URL | https://issues.apache.org/jira/secure/attachment/12893418/HBASE-19019.branch-1.002.patch
|
| Optional Tests |  asflicense  javac  javadoc  unit  findbugs  shadedjars  hadoopcheck  hbaseanti
 checkstyle  compile  |
| uname | Linux 5b563b31831c 3.13.0-129-generic #178-Ubuntu SMP Fri Aug 11 12:48:20 UTC 2017
x86_64 x86_64 x86_64 GNU/Linux |
| Build tool | maven |
| Personality | /home/jenkins/jenkins-slave/workspace/PreCommit-HBASE-Build/component/dev-support/hbase-personality.sh
|
| git revision | branch-1 / ae6a951 |
| Default Java | 1.7.0_151 |
| findbugs | v3.0.0 |
|  Test Results | https://builds.apache.org/job/PreCommit-HBASE-Build/9305/testReport/ |
| modules | C: hbase-thrift U: hbase-thrift |
| Console output | https://builds.apache.org/job/PreCommit-HBASE-Build/9305/console |
| Powered by | Apache Yetus 0.4.0   http://yetus.apache.org |


This message was automatically generated.



> QA fails on hbase-thrift module with timeout
> --------------------------------------------
>
>                 Key: HBASE-19019
>                 URL: https://issues.apache.org/jira/browse/HBASE-19019
>             Project: HBase
>          Issue Type: Bug
>          Components: Thrift
>            Reporter: Peter Somogyi
>            Priority: Critical
>         Attachments: HBASE-19019.branch-1.001.patch, HBASE-19019.branch-1.002.patch,
HBASE-19019.master.001.patch
>
>
> For any modification in hbase-thrift module the precommit build fails with timeout for
{{TestThriftServerCmdLine}}. I noticed this failure on multiple patches: HBASE-18967 and HBASE-18996
even when the patch did not contain any modification (https://issues.apache.org/jira/secure/attachment/12892414/HBASE-18967.branch-1.3.002.patch)
> The {{TestThriftServerCmdLine}} test passes locally on both mentioned patches.
> One failure: https://builds.apache.org/job/PreCommit-HBASE-Build/9127/
> {code}
> [INFO] --- maven-surefire-plugin:2.18.1:test (default-test) @ hbase-thrift ---
> [INFO] Surefire report directory: /testptch/hbase/hbase-thrift/target/surefire-reports
> [INFO] Using configured provider org.apache.maven.surefire.junitcore.JUnitCoreProvider
> [INFO] parallel='none', perCoreThreadCount=true, threadCount=0, useUnlimitedThreads=false,
threadCountSuites=0, threadCountClasses=0, threadCountMethods=0, parallelOptimized=true
> -------------------------------------------------------
>  T E S T S
> -------------------------------------------------------
> Running org.apache.hadoop.hbase.thrift2.TestThriftHBaseServiceHandler
> Tests run: 29, Failures: 0, Errors: 0, Skipped: 0, Time elapsed: 48.201 sec - in org.apache.hadoop.hbase.thrift2.TestThriftHBaseServiceHandler
> Running org.apache.hadoop.hbase.thrift2.TestThriftHBaseServiceHandlerWithReadOnly
> Tests run: 15, Failures: 0, Errors: 0, Skipped: 0, Time elapsed: 1.257 sec - in org.apache.hadoop.hbase.thrift2.TestThriftHBaseServiceHandlerWithReadOnly
> Running org.apache.hadoop.hbase.thrift2.TestThriftHBaseServiceHandlerWithLabels
> Tests run: 6, Failures: 0, Errors: 0, Skipped: 0, Time elapsed: 1.621 sec - in org.apache.hadoop.hbase.thrift2.TestThriftHBaseServiceHandlerWithLabels
> Running org.apache.hadoop.hbase.thrift.TestCallQueue
> Tests run: 18, Failures: 0, Errors: 0, Skipped: 0, Time elapsed: 0.473 sec - in org.apache.hadoop.hbase.thrift.TestCallQueue
> Running org.apache.hadoop.hbase.thrift.TestThriftHttpServer
> Tests run: 2, Failures: 0, Errors: 0, Skipped: 0, Time elapsed: 5.239 sec - in org.apache.hadoop.hbase.thrift.TestThriftHttpServer
> Running org.apache.hadoop.hbase.thrift.TestThriftServer
> Tests run: 2, Failures: 0, Errors: 0, Skipped: 0, Time elapsed: 75.55 sec - in org.apache.hadoop.hbase.thrift.TestThriftServer
> Running org.apache.hadoop.hbase.thrift.TestThriftServerCmdLine
> Results :
> Tests run: 72, Failures: 0, Errors: 0, Skipped: 0
> [INFO] ------------------------------------------------------------------------
> [INFO] BUILD FAILURE
> [INFO] ------------------------------------------------------------------------
> [INFO] Total time: 18:33.104s
> [INFO] Finished at: Mon Oct 16 03:42:59 UTC 2017
> [INFO] Final Memory: 61M/1299M
> [INFO] ------------------------------------------------------------------------
> [ERROR] Failed to execute goal org.apache.maven.plugins:maven-surefire-plugin:2.18.1:test
(default-test) on project hbase-thrift: There was a timeout or other error in the fork ->
[Help 1]
> [ERROR] 
> [ERROR] To see the full stack trace of the errors, re-run Maven with the -e switch.
> [ERROR] Re-run Maven using the -X switch to enable full debug logging.
> [ERROR] 
> [ERROR] For more information about the errors and possible solutions, please read the
following articles:
> [ERROR] [Help 1] http://cwiki.apache.org/confluence/display/MAVEN/MojoFailureException
> {code}



--
This message was sent by Atlassian JIRA
(v6.4.14#64029)

Mime
View raw message