hbase-issues mailing list archives

Site index · List index
Message view « Date » · « Thread »
Top « Date » · « Thread »
From "Hudson (JIRA)" <j...@apache.org>
Subject [jira] [Commented] (HBASE-18813) TestCanaryTool fails on branch-1 / branch-1.4
Date Thu, 14 Sep 2017 03:48:00 GMT

    [ https://issues.apache.org/jira/browse/HBASE-18813?page=com.atlassian.jira.plugin.system.issuetabpanels:comment-tabpanel&focusedCommentId=16165681#comment-16165681
] 

Hudson commented on HBASE-18813:
--------------------------------

FAILURE: Integrated in Jenkins build HBase-1.4 #914 (See [https://builds.apache.org/job/HBase-1.4/914/])
HBASE-18813 TestCanaryTool fails on branch-1 / branch-1.4 (apurtell: rev b55ae2d4a9910c1cc114acd6dfbc60095f326a1c)
* (edit) pom.xml


> TestCanaryTool fails on branch-1 / branch-1.4 
> ----------------------------------------------
>
>                 Key: HBASE-18813
>                 URL: https://issues.apache.org/jira/browse/HBASE-18813
>             Project: HBase
>          Issue Type: Bug
>            Reporter: Andrew Purtell
>            Assignee: Andrew Purtell
>             Fix For: 1.4.0, 1.5.0
>
>         Attachments: HBASE-18813-branch-1.patch
>
>
> Mocking error
> {noformat}
> Running org.apache.hadoop.hbase.tool.TestCanaryTool
> Tests run: 7, Failures: 1, Errors: 0, Skipped: 0, Time elapsed: 77.873 sec <<<
FAILURE! - in org.apache.hadoop.hbase.tool.TestCanaryTool
> testReadTableTimeouts(org.apache.hadoop.hbase.tool.TestCanaryTool)  Time elapsed: 13.845
sec  <<< FAILURE!
> org.mockito.exceptions.verification.junit.ArgumentsAreDifferent: 
> Argument(s) are different! Wanted:
> mockAppender.doAppend(
>     <custom argument matcher>
> );
> -> at org.apache.hadoop.hbase.tool.TestCanaryTool.testReadTableTimeouts(TestCanaryTool.java:150)
> Actual invocation has different arguments:
> mockAppender.doAppend(
>     org.apache.log4j.spi.LoggingEvent@7f5fcfe9
> );
> -> at org.apache.log4j.helpers.AppenderAttachableImpl.appendLoopOnAppenders(AppenderAttachableImpl.java:66)
> 	at sun.reflect.NativeConstructorAccessorImpl.newInstance0(Native Method)
> 	at sun.reflect.NativeConstructorAccessorImpl.newInstance(NativeConstructorAccessorImpl.java:62)
> 	at sun.reflect.DelegatingConstructorAccessorImpl.newInstance(DelegatingConstructorAccessorImpl.java:45)
> 	at java.lang.reflect.Constructor.newInstance(Constructor.java:423)
> 	at org.apache.hadoop.hbase.tool.TestCanaryTool.testReadTableTimeouts(TestCanaryTool.java:150)
> Results :
> Failed tests: 
>   TestCanaryTool.testReadTableTimeouts:150 
> Argument(s) are different! Wanted:
> mockAppender.doAppend(
>     <custom argument matcher>
> );
> -> at org.apache.hadoop.hbase.tool.TestCanaryTool.testReadTableTimeouts(TestCanaryTool.java:150)
> Actual invocation has different arguments:
> mockAppender.doAppend(
>     org.apache.log4j.spi.LoggingEvent@7f5fcfe9
> );
> -> at org.apache.log4j.helpers.AppenderAttachableImpl.appendLoopOnAppenders(AppenderAttachableImpl.java:66)
> {noformat}



--
This message was sent by Atlassian JIRA
(v6.4.14#64029)

Mime
View raw message