hbase-issues mailing list archives

Site index · List index
Message view « Date » · « Thread »
Top « Date » · « Thread »
From "Hudson (JIRA)" <j...@apache.org>
Subject [jira] [Commented] (HBASE-18346) TestRSKilledWhenInitializing failing on branch-1 (branch-1.4)
Date Thu, 14 Sep 2017 00:59:00 GMT

    [ https://issues.apache.org/jira/browse/HBASE-18346?page=com.atlassian.jira.plugin.system.issuetabpanels:comment-tabpanel&focusedCommentId=16165556#comment-16165556
] 

Hudson commented on HBASE-18346:
--------------------------------

FAILURE: Integrated in Jenkins build HBase-1.5 #57 (See [https://builds.apache.org/job/HBase-1.5/57/])
HBASE-18346 TestRSKilledWhenInitializing failing on branch-1 (apurtell: rev 0621486620783830c766955c3d9f4feb878248e1)
* (edit) hbase-server/src/test/java/org/apache/hadoop/hbase/regionserver/TestRSKilledWhenInitializing.java


> TestRSKilledWhenInitializing failing on branch-1 (branch-1.4)
> -------------------------------------------------------------
>
>                 Key: HBASE-18346
>                 URL: https://issues.apache.org/jira/browse/HBASE-18346
>             Project: HBase
>          Issue Type: Bug
>            Reporter: Andrew Purtell
>            Assignee: Andrew Purtell
>             Fix For: 1.4.0, 1.5.0
>
>         Attachments: HBASE-18346-branch-1.patch
>
>
> Running org.apache.hadoop.hbase.regionserver.TestRSKilledWhenInitializing
> Tests run: 1, Failures: 1, Errors: 0, Skipped: 0, Time elapsed: 12.343 sec <<<
FAILURE! - in org.apache.hadoop.hbase.regionserver.TestRSKilledWhenInitiali
> zing
> testRSTerminationAfterRegisteringToMasterBeforeCreatingEphemeralNode(org.apache.hadoop.hbase.regionserver.TestRSKilledWhenInitializing)
 Time elapsed: 12.
> 329 sec  <<< FAILURE!
> java.lang.AssertionError: null
>         at org.junit.Assert.fail(Assert.java:86)
>         at org.junit.Assert.assertTrue(Assert.java:41)
>         at org.junit.Assert.assertTrue(Assert.java:52)
>         at org.apache.hadoop.hbase.regionserver.TestRSKilledWhenInitializing.testRSTerminationAfterRegisteringToMasterBeforeCreatingEphemeralNode(TestRSKi
> lledWhenInitializing.java:123)
> Tests run: 2, Failures: 0, Errors: 2, Skipped: 0, Time elapsed: 192.427 sec <<<
FAILURE! - in org.apache.hadoop.hbase.regionserver.TestRSKilledWhenInitial
> izing
> testRSTerminationAfterRegisteringToMasterBeforeCreatingEphemeralNode(org.apache.hadoop.hbase.regionserver.TestRSKilledWhenInitializing)
 Time elapsed: 179
> .859 sec  <<< ERROR!
> org.junit.runners.model.TestTimedOutException: test timed out after 180 seconds
>         at java.lang.Thread.sleep(Native Method)
>         at org.apache.hadoop.hbase.util.Threads.sleep(Threads.java:146)
>         at org.apache.hadoop.hbase.regionserver.TestRSKilledWhenInitializing.testRSTerminationAfterRegisteringToMasterBeforeCreatingEphemeralNode(TestRSKi
> lledWhenInitializing.java:113)



--
This message was sent by Atlassian JIRA
(v6.4.14#64029)

Mime
View raw message