hbase-issues mailing list archives

Site index · List index
Message view « Date » · « Thread »
Top « Date » · « Thread »
From "Anastasia Braginsky (JIRA)" <j...@apache.org>
Subject [jira] [Commented] (HBASE-18682) TestCompactingMemStore#testFlatteningToCellChunkMap fails in master
Date Sun, 27 Aug 2017 08:37:00 GMT

    [ https://issues.apache.org/jira/browse/HBASE-18682?page=com.atlassian.jira.plugin.system.issuetabpanels:comment-tabpanel&focusedCommentId=16143039#comment-16143039
] 

Anastasia Braginsky commented on HBASE-18682:
---------------------------------------------

I will not be in the office this week, so if it can wait till next week, I can try to (anyhow
remotely) look on this problem then. Or may be you can try to debug it if it is urgent...

> TestCompactingMemStore#testFlatteningToCellChunkMap fails in master
> -------------------------------------------------------------------
>
>                 Key: HBASE-18682
>                 URL: https://issues.apache.org/jira/browse/HBASE-18682
>             Project: HBase
>          Issue Type: Bug
>          Components: test
>            Reporter: Chia-Ping Tsai
>            Priority: Minor
>             Fix For: 2.0.0
>
>
> The UT works well on my centos(64-bits) but it always fails on my ubuntu(17.04 64-bits).

> {code}
> Running org.apache.hadoop.hbase.regionserver.TestCompactingMemStore
> Tests run: 1, Failures: 1, Errors: 0, Skipped: 0, Time elapsed: 1.998 sec <<<
FAILURE! - in org.apache.hadoop.hbase.regionserver.TestCompactingMemStore
> testFlatteningToCellChunkMap(org.apache.hadoop.hbase.regionserver.TestCompactingMemStore)
 Time elapsed: 1.64 sec  <<< FAILURE!
> java.lang.AssertionError: expected:<920> but was:<952>
> 	at org.apache.hadoop.hbase.regionserver.TestCompactingMemStore.testFlatteningToCellChunkMap(TestCompactingMemStore.java:609)
> {code}



--
This message was sent by Atlassian JIRA
(v6.4.14#64029)

Mime
View raw message