hbase-issues mailing list archives

Site index · List index
Message view « Date » · « Thread »
Top « Date » · « Thread »
From "stack (JIRA)" <j...@apache.org>
Subject [jira] [Commented] (HBASE-17614) Move Backup/Restore into separate module
Date Wed, 23 Aug 2017 00:18:01 GMT

    [ https://issues.apache.org/jira/browse/HBASE-17614?page=com.atlassian.jira.plugin.system.issuetabpanels:comment-tabpanel&focusedCommentId=16137654#comment-16137654
] 

stack commented on HBASE-17614:
-------------------------------

Ran again:

{code}

-------------------------------------------------------
 T E S T S
-------------------------------------------------------



Running org.apache.hadoop.hbase.backup.TestBackupHFileCleaner



Tests run: 1, Failures: 0, Errors: 0, Skipped: 0, Time elapsed: 49.127 sec - in org.apache.hadoop.hbase.backup.TestBackupHFileCleaner
Running org.apache.hadoop.hbase.backup.TestBackupCommandLineTool
Tests run: 16, Failures: 0, Errors: 0, Skipped: 0, Time elapsed: 0.743 sec - in org.apache.hadoop.hbase.backup.TestBackupCommandLineTool

Results :

Tests run: 17, Failures: 0, Errors: 0, Skipped: 0

[INFO]
[INFO] --- maven-surefire-plugin:2.19.1:test (secondPartTestsExecution) @ hbase-backup ---

-------------------------------------------------------
 T E S T S
-------------------------------------------------------
Running org.apache.hadoop.hbase.backup.TestIncrementalBackupDeleteTable
Running org.apache.hadoop.hbase.backup.TestBackupDescribe
Running org.apache.hadoop.hbase.backup.TestIncrementalBackupMergeWithFailures
Running org.apache.hadoop.hbase.backup.TestFullBackupSet
Running org.apache.hadoop.hbase.backup.master.TestBackupLogCleaner



Tests run: 1, Failures: 1, Errors: 0, Skipped: 0, Time elapsed: 518.986 sec <<< FAILURE!
- in org.apache.hadoop.hbase.backup.master.TestBackupLogCleaner
testBackupLogCleaner(org.apache.hadoop.hbase.backup.master.TestBackupLogCleaner)  Time elapsed:
516.534 sec  <<< FAILURE!
java.lang.AssertionError
        at org.apache.hadoop.hbase.backup.master.TestBackupLogCleaner.testBackupLogCleaner(TestBackupLogCleaner.java:93)

Running org.apache.hadoop.hbase.backup.TestBackupRepair
Tests run: 3, Failures: 0, Errors: 0, Skipped: 0, Time elapsed: 553.194 sec - in org.apache.hadoop.hbase.backup.TestBackupDescribe
Running org.apache.hadoop.hbase.backup.TestRemoteRestore
Tests run: 2, Failures: 0, Errors: 0, Skipped: 0, Time elapsed: 602.338 sec - in org.apache.hadoop.hbase.backup.TestFullBackupSet
Running org.apache.hadoop.hbase.backup.TestBackupShowHistory
Running org.apache.hadoop.hbase.backup.TestFullBackup
Running org.apache.hadoop.hbase.backup.TestRemoteBackup
Running org.apache.hadoop.hbase.backup.TestBackupStatusProgress
Running org.apache.hadoop.hbase.backup.TestIncrementalBackup
Running org.apache.hadoop.hbase.backup.TestBackupMultipleDeletes
Running org.apache.hadoop.hbase.backup.TestBackupBoundaryTests
Running org.apache.hadoop.hbase.backup.TestFullRestore
Running org.apache.hadoop.hbase.backup.TestRepairAfterFailedDelete
Running org.apache.hadoop.hbase.backup.TestBackupDeleteRestore
Running org.apache.hadoop.hbase.backup.TestIncrementalBackupWithBulkLoad
Running org.apache.hadoop.hbase.backup.TestRestoreBoundaryTests
Running org.apache.hadoop.hbase.backup.TestBackupDeleteWithFailures
Running org.apache.hadoop.hbase.backup.TestBackupDelete
Running org.apache.hadoop.hbase.backup.TestIncrementalBackupWithFailures
Running org.apache.hadoop.hbase.backup.TestFullBackupSetRestoreSet
Running org.apache.hadoop.hbase.backup.TestFullBackupWithFailures

Results :

Failed tests:
  TestBackupLogCleaner.testBackupLogCleaner:93

Tests run: 6, Failures: 1, Errors: 0, Skipped: 0

[INFO] ------------------------------------------------------------------------
[INFO] BUILD FAILURE
[INFO] ------------------------------------------------------------------------
[INFO] Total time: 20:08.911s
[INFO] Finished at: Tue Aug 22 17:09:44 PDT 2017
[INFO] Final Memory: 43M/1779M
[INFO] ------------------------------------------------------------------------
[ERROR] Failed to execute goal org.apache.maven.plugins:maven-surefire-plugin:2.19.1:test
(secondPartTestsExecution) on project hbase-backup: ExecutionException The forked VM terminated
without properly saying goodbye. VM crash or System.exit called?
[ERROR] Command was /bin/sh -c cd /home/stack/hbase.git/hbase-backup && /home/stack/bin/jdk1.8.0_101/jre/bin/java
-enableassertions -Dhbase.build.id=2017-08-22T16:49:35Z -Xmx2800m -Djava.security.egd=file:/dev/./urandom
-Djava.net.preferIPv4Stack=true -Djava.awt.headless=true -jar /home/stack/hbase.git/hbase-backup/target/surefire/surefirebooter3260628695888461598.jar
/home/stack/hbase.git/hbase-backup/target/surefire/surefire6421378557322491102tmp /home/stack/hbase.git/hbase-backup/target/surefire/surefire_326873114336621816595tmp
[ERROR] -> [Help 1]
[ERROR]
[ERROR] To see the full stack trace of the errors, re-run Maven with the -e switch.
[ERROR] Re-run Maven using the -X switch to enable full debug logging.
[ERROR]
[ERROR] For more information about the errors and possible solutions, please read the following
articles:
[ERROR] [Help 1] http://cwiki.apache.org/confluence/display/MAVEN/MojoFailureException
{code}

> Move Backup/Restore into separate module 
> -----------------------------------------
>
>                 Key: HBASE-17614
>                 URL: https://issues.apache.org/jira/browse/HBASE-17614
>             Project: HBase
>          Issue Type: Task
>            Reporter: Vladimir Rodionov
>            Assignee: Vladimir Rodionov
>            Priority: Blocker
>              Labels: backup
>             Fix For: 2.0.0
>
>         Attachments: HBASE-17614-v1.patch, HBASE-17614-v2.patch, HBASE-17614-v3.patch,
HBASE-17614-v4.patch, HBASE-17614-v5.patch
>
>
> Move all the backup code into separate hbase-backup module.



--
This message was sent by Atlassian JIRA
(v6.4.14#64029)

Mime
View raw message